{"text_format":"1","workbook":"xlsx","n_sheets":10,"sheets":["PeriodAdmin","LanguageAdmin","Income statement - 6Q ","Balance sheet - 6Q","Cash flow statement - 6Q","Net sales by vertical - 6Q  New","Quarterly data - 6Q","APM - 6Q","APM - calculations - 6Q","SysAdmin"],"not_rendered":{"charts":0,"images":0,"macros":1,"external_links":3,"defined_names":372,"comments":0,"pivot_tables":0},"unopened":[],"bounds":{"document_bytes":16777216,"sheet_cells":100000,"rows_first":2000,"rows_last":500,"rows_between":2000,"halvings":0,"cell_chars":16384,"cell_head_chars":4096},"cells_cut":0,"cells_raw":0,"read":"whole","date_system":"1900"}

{"sheet":"PeriodAdmin","index":0,"n_rows":191,"n_cols":19,"rows_kept":191,"cut":false,"hidden":true,"merged":[[169,7,184,7],[186,7,190,7],[72,7,87,7],[88,7,103,7],[104,7,119,7],[120,7,135,7],[136,7,151,7],[152,7,167,7],[56,7,71,7],[4,8,5,8],[4,9,5,9],[8,7,23,7],[24,7,39,7],[40,7,55,7]]}
[]
[null,null,null,null,null,null,null,null,null,null,"Q_No",{"$f":"VALUE(RIGHT(Sel_Quarter,1))","v":1}]
[null,null,null,null,null,null,null,null,null,null,"SelectIdx",{"$f":"Q_No+IF(Sel_Lang=\"ENG\",4,0)","v":5}]
[]
[null,null,null,null,null,null,null,null,"Namn","Rubrik till vald period"]
[null,null,null,null,null,null,null,null,null,null,"SWE",null,null,null,"ENG",null,null,null,"Divider"]
[null,null,"Name","Year","Name","Y",null,null,"ActPer_nMonth",{"$f":"INDEX(K7:R7,,SelectIdx)","v":"Three months"},"Tre månader","Sex månader","Nio månader","Helår","Three months","Six months","Nine months","Full-year"]
[null,null,"ActYear",2026,"ActY",{"$f":"VALUE(RIGHT(Sel_Year,2))","v":26},null,null,"ActPer_noMonth","3 months","3 månader","6 månader","9 månader","12 månader","3 months","6 months","9 months","12 months"]
[null,null,"ActYear_m1Y",{"$f":"D8-1","v":2025},"ActY_m1Y",{"$f":"TEXT(F8-1,\"00\")","v":"25"},null,"Perioden","ActQn",1,1,2,3,4,1,2,3,4]
[null,null,"ActYear_m2Y",{"$f":"D9-1","v":2024},"ActY_m2Y","24",null,null,"ActQ","Q1",{"$f":"\"Q\"&K9","v":"Q1"},"Q2","Q3","Q4","Q1","Q2","Q3","Q4"]
[null,null,"ActYear_m3Y",2023,"ActY_m3Y","23",null,null,"ActQ_Year","Q1 2026",{"$f":"K10&$S11&Sel_Year","v":"Q1 2026"},{"$f":"L10&$S11&Sel_Year","v":"Q2 2026"},"Q3 2026","Q4 2026","Q1 2026","Q2 2026","Q3 2026","Q4 2026"," "]
[null,null,"ActYear_m4Y",2022,"ActY_m4Y","22",null,null,"ActQ_Y","Q1 26",{"$f":"K10&$S12&ActY","v":"Q1 26"},"Q2 26","Q3 26","Q4 26","Q1 26","Q2 26","Q3 26","Q4 26"," "]
[null,null,"ActYear_m5Y",2021,"ActY_m5Y","21",null,null,"ActQn_Year","1 2026",{"$f":"K9&$S13&Sel_Year","v":"1 2026"},"2 2026","3 2026","4 2026","1 2026","2 2026","3 2026","4 2026"," "]
[null,null,"ActYear_m6Y",2020,"ActY_m6Y","20",null,null,"ActQn_Y","1 26",{"$f":"K9&$S14&ActY","v":"1 26"},"2 26","3 26","4 26","1 26","2 26","3 26","4 26"," "]
[null,null,"ActYear_m7Y",2019,"ActY_m7Y","19",null,null,"ActMon","03","03","06","09","12","03","06","09","12"]
[null,null,"ActYear_m8Y",2018,"ActY_m8Y","18",null,null,"ActYearMonth","2026 03",{"$f":"ActYear&$S16&K15","v":"2026 03"},"2026 06","2026 09","2026 12","2026 03","2026 06","2026 09","2026 12"," "]
[null,null,"ActYear_m9Y",2017,"ActY_m9Y","17",null,null,"ActQBrMDay","31 Mar","31 mar","30 jun","30 sep","31 dec","31 Mar","30 Jun","30 Sep","31 Dec"]
[null,null,"ActYear_m10Y",2016,"ActY_m10Y","16",null,null,"ActQBrDate","2026-03-31",{"$f":"EOMONTH(DATE(ActYear,K15,1),0)","v":"2026-03-31"},"2026-06-30","2026-09-30","2026-12-31","2026-03-31","2026-06-30","2026-09-30","2026-12-31"]
[null,null,null,null,null,null,null,null,"ActQBrDateYear","31 Mar 2026",{"$f":"K17&$S19&ActYear","v":"31 mar 2026"},"30 jun 2026","30 sep 2026","31 dec 2026","31 Mar 2026","30 Jun 2026","30 Sep 2026","31 Dec 2026"," "]
[null,null,"ActHYear",{"$f":"\"H1 \"&ActYear","v":"H1 2026"},null,null,null,null,"ActQBrDateY","31 Mar 26",{"$f":"K17&$S20&ActY","v":"31 mar 26"},"30 jun 26","30 sep 26","31 dec 26","31 Mar 26","30 Jun 26","30 Sep 26","31 Dec 26"," "]
[null,null,"ActHYear_m1Y",{"$f":"\"H1 \"&ActYear_m1Y","v":"H1 2025"},null,null,null,null,"ActPerYear","Jan-Mar 2026",{"$f":"K23&$S21&ActYear","v":"jan-mar 2026"},"apr-jun 2026","jul-sep 2026","okt-dec 2026","Jan-Mar 2026","Apr-Jun 2026","Jul-Sep 2026","Oct-Dec 2026"," "]
[null,null,null,null,null,null,null,null,"ActPerY",{"$f":"INDEX(K22:R22,,SelectIdx)","v":"Jan-Mar 26"},{"$f":"K23&$S21&ActY","v":"jan-mar 26"},"apr-jun 26","jul-sep 26","okt-dec 26","Jan-Mar 26","Apr-Jun 26","Jul-Sep 26","Oct-Dec 26"]
[null,null,"ActFullYear","jan-dec","Jan-Dec",{"$f":"IF(INDEX($D23:$E23,,SelLngNo)=0,\"\",INDEX($D23:$E23,,SelLngNo)) & \" \" & ActYear","v":"Jan-Dec 2026"},null,null,"ActPer","Jan-Mar","jan-mar","apr-jun","jul-sep","okt-dec","Jan-Mar","Apr-Jun","Jul-Sep","Oct-Dec"]
[null,null,"ActFullYear_m1Y","jan-dec","Jan-Dec",{"$f":"IF(INDEX($D24:$E24,,SelLngNo)=0,\"\",INDEX($D24:$E24,,SelLngNo))&\" \"&ActYear_m1Y","v":"Jan-Dec 2025"},null,null,"ActAckPer","Jan-Mar","jan-mar","jan-jun","jan-sep","jan-dec","Jan-Mar","Jan-Jun","Jan-Sep","Jan-Dec"]
[null,null,"FullYear","jan-dec","Jan-Dec",{"$f":"IF(INDEX($D25:$E25,,SelLngNo)=0,\"\",INDEX($D25:$E25,,SelLngNo))","v":"Jan-Dec"},null,"Perioden minus 1Q","m1Q_Qn",4,{"$f":"N9","v":4},{"$f":"K9","v":1},{"$f":"L9","v":2},{"$f":"M9","v":3},{"$f":"R9","v":4},{"$f":"O9","v":1},{"$f":"P9","v":2},{"$f":"Q9","v":3},{"$f":"IF(S9=\"\",\"\",S9)","v":""}]
[null,null,"FullYearBrDay","31 dec","31 Dec","31 Dec",null,null,"m1Q_Q","Q4",{"$f":"\"Q\"&K25","v":"Q4"},"Q1","Q2","Q3","Q4","Q1","Q2","Q3",""]
[null,null,"FullYearBrDate",{"$f":"DATE(ActYear,12,31)","v":"2026-12-31"},{"$f":"DATE(ActYear,12,31)","v":"2026-12-31"},"2026-12-31",null,null,"m1Q_Q_Year","Q4 2025",{"$f":"K26&$S27&ActYear_m1Y","v":"Q4 2025"},{"$f":"L26&$S27&Sel_Year","v":"Q1 2026"},{"$f":"M26&$S27&Sel_Year","v":"Q2 2026"},{"$f":"N26&$S27&Sel_Year","v":"Q3 2026"},{"$f":"O26&$S27&ActYear_m1Y","v":"Q4 2025"},{"$f":"P26&$S27&Sel_Year","v":"Q1 2026"},{"$f":"Q26&$S27&Sel_Year","v":"Q2 2026"},{"$f":"R26&$S27&Sel_Year","v":"Q3 2026"}," "]
[null,null,"ActFullYearM","jan-dec","Jan-Dec","Jan-Dec",null,null,"m1Q_Q_Y","Q4 25",{"$f":"K26&$S28&ActY_m1Y","v":"Q4 25"},{"$f":"L26&$S28&ActY","v":"Q1 26"},{"$f":"M26&$S28&ActY","v":"Q2 26"},{"$f":"N26&$S28&ActY","v":"Q3 26"},{"$f":"O26&$S28&ActY_m1Y","v":"Q4 25"},{"$f":"P26&$S28&ActY","v":"Q1 26"},{"$f":"Q26&$S28&ActY","v":"Q2 26"},{"$f":"R26&$S28&ActY","v":"Q3 26"}," "]
[null,null,"ActFullYearM_1Y","jan-dec","Jan-Dec","Jan-Dec",null,null,"m1Q_Qn_Year","4 2025",{"$f":"K25&$S29&ActYear_m1Y","v":"4 2025"},{"$f":"L25&$S29&Sel_Year","v":"1 2026"},{"$f":"M25&$S29&Sel_Year","v":"2 2026"},{"$f":"N25&$S29&Sel_Year","v":"3 2026"},{"$f":"O25&$S29&ActYear_m1Y","v":"4 2025"},{"$f":"P25&$S29&ActYear","v":"1 2026"},{"$f":"Q25&$S29&Sel_Year","v":"2 2026"},{"$f":"R25&$S29&Sel_Year","v":"3 2026"}," "]
[null,null,"FullYearBrDate_1Y",{"$f":"DATE(ActYear_m1Y,12,31)","v":"2025-12-31"},{"$f":"DATE(ActYear_m1Y,12,31)","v":"2025-12-31"},"2025-12-31",null,null,"m1Q_Qn_Y","4 25",{"$f":"K25&$S30&ActY_m1Y","v":"4 25"},{"$f":"L25&$S30&ActY","v":"1 26"},{"$f":"M25&$S30&ActY","v":"2 26"},{"$f":"N25&$S30&ActY","v":"3 26"},{"$f":"O25&$S30&ActY_m1Y","v":"4 25"},{"$f":"P25&$S30&ActY","v":"1 26"},{"$f":"Q25&$S30&ActY","v":"2 26"},{"$f":"R25&$S30&ActY","v":"3 26"}," "]
[null,null,"FullYearBrDate_2Y",{"$f":"DATE(ActYear_m2Y,12,31)","v":"2024-12-31"},{"$f":"DATE(ActYear_m2Y,12,31)","v":"2024-12-31"},"2024-12-31",null,null,"m1Q_Mon","12",{"$f":"N15","v":"12"},{"$f":"K15","v":"03"},{"$f":"L15","v":"06"},{"$f":"M15","v":"09"},{"$f":"R15","v":"12"},{"$f":"O15","v":"03"},{"$f":"P15","v":"06"},{"$f":"Q15","v":"09"},""]
[null,null,"FullYearBrDate_3Y",{"$f":"DATE(ActYear_m3Y,12,31)","v":"2023-12-31"},{"$f":"DATE(ActYear_m3Y,12,31)","v":"2023-12-31"},"2023-12-31",null,null,"m1Q_YearMonth","2025 12",{"$f":"ActYear_m1Y&$S32&K31","v":"2025 12"},{"$f":"ActYear&$S32&L31","v":"2026 03"},{"$f":"ActYear&$S32&M31","v":"2026 06"},{"$f":"ActYear&$S32&N31","v":"2026 09"},{"$f":"ActYear_m1Y&$S32&O31","v":"2025 12"},{"$f":"ActYear&$S32&P31","v":"2026 03"},{"$f":"ActYear&$S32&Q31","v":"2026 06"},{"$f":"ActYear&$S32&R31","v":"2026 09"}," "]
[null,null,null,null,null,null,null,null,"m1Q_QBrMDay","31 Dec",{"$f":"N17","v":"31 dec"},{"$f":"K17","v":"31 mar"},{"$f":"L17","v":"30 jun"},{"$f":"M17","v":"30 sep"},{"$f":"R17","v":"31 Dec"},{"$f":"O17","v":"31 Mar"},{"$f":"P17","v":"30 Jun"},{"$f":"Q17","v":"30 Sep"},""]
[null,null,"FullYearT","Helår","Full-year",{"$f":"IF(INDEX($D34:$E34,,SelLngNo)=0,\"\",INDEX($D34:$E34,,SelLngNo))","v":"Full-year"},null,null,"m1Q_QBrDate","2025-12-31",{"$f":"EOMONTH(DATE(ActYear_m1Y,K31,1),0)","v":"2025-12-31"},{"$f":"EOMONTH(DATE(ActYear,L31,1),0)","v":"2026-03-31"},{"$f":"EOMONTH(DATE(ActYear,M31,1),0)","v":"2026-06-30"},{"$f":"EOMONTH(DATE(ActYear,N31,1),0)","v":"2026-09-30"},{"$f":"EOMONTH(DATE(ActYear_m1Y,O31,1),0)","v":"2025-12-31"},{"$f":"EOMONTH(DATE(ActYear,P31,1),0)","v":"2026-03-31"},{"$f":"EOMONTH(DATE(ActYear,Q31,1),0)","v":"2026-06-30"},{"$f":"EOMONTH(DATE(ActYear,R31,1),0)","v":"2026-09-30"},""]
[null,null,"QuarterT","Kvartal","Quarter",{"$f":"IF(INDEX($D35:$E35,,SelLngNo)=0,\"\",INDEX($D35:$E35,,SelLngNo))","v":"Quarter"},null,null,"m1Q_QBrDateYear","31 Dec 2025",{"$f":"K33&$S35&ActYear_m1Y","v":"31 dec 2025"},{"$f":"L33&$S35&ActYear","v":"31 mar 2026"},{"$f":"M33&$S35&ActYear","v":"30 jun 2026"},{"$f":"N33&$S35&ActYear","v":"30 sep 2026"},{"$f":"O33&$S35&ActYear_m1Y","v":"31 Dec 2025"},{"$f":"P33&$S35&ActYear","v":"31 Mar 2026"},{"$f":"Q33&$S35&ActYear","v":"30 Jun 2026"},{"$f":"R33&$S35&ActYear","v":"30 Sep 2026"}," "]
[null,null,"Txt_R12","R12","LTM",{"$f":"IF(INDEX($D36:$E36,,SelLngNo)=0,\"\",INDEX($D36:$E36,,SelLngNo))","v":"LTM"},null,null,"m1Q_QBrDateY","31 Dec 25",{"$f":"K33&$S36&ActY_m1Y","v":"31 dec 25"},{"$f":"L33&$S36&ActY","v":"31 mar 26"},{"$f":"M33&$S36&ActY","v":"30 jun 26"},{"$f":"N33&$S36&ActY","v":"30 sep 26"},{"$f":"O33&$S36&ActY_m1Y","v":"31 Dec 25"},{"$f":"P33&$S36&ActY","v":"31 Mar 26"},{"$f":"Q33&$S36&ActY","v":"30 Jun 26"},{"$f":"R33&$S36&ActY","v":"30 Sep 26"}," "]
[null,null,"Act_R12_Year",null,null,{"$f":"RIGHT(ActYear_m1Y,2)&\"/\"&RIGHT(ActYear,2)","v":"25/26"},null,null,"m1Q_PerYear","Oct-Dec 2025",{"$f":"K39&$S37&ActYear_m1Y","v":"okt-dec 2025"},{"$f":"L39&$S37&ActYear","v":"jan-mar 2026"},{"$f":"M39&$S37&ActYear","v":"apr-jun 2026"},{"$f":"N39&$S37&ActYear","v":"jul-sep 2026"},{"$f":"O39&$S37&ActYear_m1Y","v":"Oct-Dec 2025"},{"$f":"P39&$S37&ActYear","v":"Jan-Mar 2026"},{"$f":"Q39&$S37&ActYear","v":"Apr-Jun 2026"},{"$f":"R39&$S37&ActYear","v":"Jul-Sep 2026"}," "]
[null,null,null,null,null,null,null,null,"m1Q_PerY","Oct-Dec 25",{"$f":"K39&$S37&ActY_m1Y","v":"okt-dec 25"},{"$f":"L39&$S37&ActY","v":"jan-mar 26"},{"$f":"M39&$S37&ActY","v":"apr-jun 26"},{"$f":"N39&$S37&ActY","v":"jul-sep 26"},{"$f":"O39&$S37&ActY_m1Y","v":"Oct-Dec 25"},{"$f":"P39&$S37&ActY","v":"Jan-Mar 26"},{"$f":"Q39&$S37&ActY","v":"Apr-Jun 26"},{"$f":"R39&$S37&ActY","v":"Jul-Sep 26"},""]
[null,null,"AARO_Act",{"$f":"ActYear&\"-\"&ActMon","v":"2026-03"},{"$f":"(RIGHT(ActYear,2))&ActMon&\"A\"","v":"2603A"},null,null,null,"m1Q_Per",{"$f":"INDEX(K39:R39,,SelectIdx)","v":"Oct-Dec"},{"$f":"N23","v":"okt-dec"},{"$f":"K23","v":"jan-mar"},"apr-jun","jul-sep",{"$f":"R23","v":"Oct-Dec"},{"$f":"O23","v":"Jan-Mar"},"Apr-Jun","Jul-Sep",""]
[null,null,"AARO_m1Q",{"$f":"RIGHT(m1Q_Q_Year,4)&\"-\"&m1Q_Mon","v":"2025-12"},{"$f":"RIGHT(m1Q_Q_Year,2)&m1Q_Mon&\"A\"","v":"2512A"},null,null,null,"m1Q_AckPer","Jan-Dec",{"$f":"N24","v":"jan-dec"},"jan-mar","jan-jun","jan-sep",{"$f":"R24","v":"Jan-Dec"},"Jan-Mar","Jan-Jun","Jan-Sep",""]
[null,null,"AARO_m2Q",{"$f":"RIGHT(m2Q_Q_Year,4)&\"-\"&m2Q_Mon","v":"2025-09"},{"$f":"RIGHT(m2Q_Q_Year,2)&m2Q_Mon&\"A\"","v":"2509A"},null,null,"Perioden minus 2Q","m2Q_Qn",3,{"$f":"N25","v":3},4,1,2,{"$f":"R25","v":3},4,1,2,""]
[null,null,"AARO_m3Q",{"$f":"RIGHT(m3Q_Q_Year,4)&\"-\"&m3Q_Mon","v":"2025-06"},{"$f":"RIGHT(m3Q_Q_Year,2)&m3Q_Mon&\"A\"","v":"2506A"},null,null,null,"m2Q_Q","Q3",{"$f":"\"Q\"&K41","v":"Q3"},"Q4","Q1","Q2","Q3","Q4","Q1","Q2",""]
[null,null,"AARO_m4Q",{"$f":"RIGHT(m4Q_Q_Year,4)&\"-\"&m4Q_Mon","v":"2025-03"},{"$f":"RIGHT(m4Q_Q_Year,2)&m4Q_Mon&\"A\"","v":"2503A"},null,null,null,"m2Q_Q_Year","Q3 2025",{"$f":"K42&$S43&ActYear_m1Y","v":"Q3 2025"},{"$f":"K27","v":"Q4 2025"},"Q1 2026","Q2 2026",{"$f":"O42&$S43&ActYear_m1Y","v":"Q3 2025"},{"$f":"O27","v":"Q4 2025"},{"$f":"P27","v":"Q1 2026"},{"$f":"Q27","v":"Q2 2026"}," "]
[null,null,"AARO_m5Q",{"$f":"RIGHT(m5Q_Q_Year,4)&\"-\"&m5Q_Mon","v":"2024-12"},{"$f":"RIGHT(m5Q_Q_Year,2)&m5Q_Mon&\"A\"","v":"2412A"},null,null,null,"m2Q_Q_Y","Q3 25",{"$f":"K42&$S44&ActY_m1Y","v":"Q3 25"},"Q4 25","Q1 26","Q2 26",{"$f":"O42&$S44&ActY_m1Y","v":"Q3 25"},{"$f":"O28","v":"Q4 25"},{"$f":"P27","v":"Q1 2026"},{"$f":"Q27","v":"Q2 2026"}," "]
[null,null,"AARO_m6Q",{"$f":"RIGHT(m6Q_Q_Year,4)&\"-\"&m6Q_Mon","v":"2024-09"},{"$f":"RIGHT(m6Q_Q_Year,2)&m6Q_Mon&\"A\"","v":"2409A"},null,null,null,"m2Q_Qn_Year","3 2025",{"$f":"K41&$S45&ActYear_m1Y","v":"3 2025"},"4 2025","1 2026","2 2026",{"$f":"O41&$S45&ActYear_m1Y","v":"3 2025"},"4 2025",{"$f":"P29","v":"1 2026"},"2 2026"," "]
[null,null,"AARO_m7Q",{"$f":"RIGHT(m7Q_Q_Year,4)&\"-\"&m7Q_Mon","v":"2024-06"},{"$f":"RIGHT(m7Q_Q_Year,2)&m7Q_Mon&\"A\"","v":"2406A"},null,null,null,"m2Q_Qn_Y","3 25",{"$f":"K41&$S46&ActY_m1Y","v":"3 25"},"4 25","1 26","2 26",{"$f":"O41&$S46&ActY_m1Y","v":"3 25"},"4 25","1 26","2 26"," "]
[null,null,"AARO_m8Q",{"$f":"RIGHT(m8Q_Q_Year,4)&\"-\"&m8Q_Mon","v":"2024-03"},{"$f":"RIGHT(m8Q_Q_Year,2)&m8Q_Mon&\"A\"","v":"2403A"},null,null,null,"m2Q_Mon","09",{"$f":"N31","v":"09"},"12","03","06",{"$f":"R31","v":"09"},"12","03","06",""]
[null,null,"AARO_m9Q",{"$f":"RIGHT(m9Q_Q_Year,4)&\"-\"&m9Q_Mon","v":"2023-12"},{"$f":"RIGHT(m9Q_Q_Year,2)&m9Q_Mon&\"A\"","v":"2312A"},null,null,null,"m2Q_YearMonth","2025 09",{"$f":"ActYear_m1Y&$S48&K47","v":"2025 09"},"2025 12","2026 03","2026 06",{"$f":"ActYear_m1Y&$S48&O47","v":"2025 09"},"2025 12","2026 03","2026 06"," "]
[null,null,null,null,null,null,null,null,"m2Q_QBrMDay","30 Sep",{"$f":"N33","v":"30 sep"},"31 dec","31 mar","30 jun",{"$f":"R33","v":"30 Sep"},"31 Dec","31 Mar","30 Jun",""]
[null,null,"AARO_PY_Act",{"$f":"ActYear_m1Y&\"-\"&ActMon","v":"2025-03"},null,null,null,null,"m2Q_QBrDate","2025-09-30",{"$f":"EOMONTH(DATE(ActYear_m1Y,K47,1),0)","v":"2025-09-30"},"2025-12-31","2026-03-31","2026-06-30",{"$f":"EOMONTH(DATE(ActYear_m1Y,O47,1),0)","v":"2025-09-30"},"2025-12-31","2026-03-31","2026-06-30",""]
[null,null,"AARO_PY_Full",{"$f":"ActYear_m1Y&\"-12\"","v":"2025-12"},null,null,null,null,"m2Q_QBrDateYear","30 Sep 2025",{"$f":"K49&$S51&ActYear_m1Y","v":"30 sep 2025"},"31 dec 2025","31 mar 2026","30 jun 2026",{"$f":"O49&$S51&ActYear_m1Y","v":"30 Sep 2025"},"31 Dec 2025","31 Mar 2026","30 Jun 2026"," "]
[null,null,null,null,null,null,null,null,"m2Q_QBrDateY","30 Sep 25",{"$f":"K49&$S52&ActY_m1Y","v":"30 sep 25"},"31 dec 25","31 mar 26","30 jun 26",{"$f":"O49&$S52&ActY_m1Y","v":"30 Sep 25"},"31 Dec 25","31 Mar 26","30 Jun 26"," "]
[null,null,"MtchNt","IdxNt",null,null,null,null,"m2Q_PerYear","Jul-Sep 2025",{"$f":"K55&$S53&ActYear_m1Y","v":"jul-sep 2025"},"okt-dec 2025","jan-mar 2026","apr-jun 2026",{"$f":"O55&$S53&ActYear_m1Y","v":"Jul-Sep 2025"},"Oct-Dec 2025","Jan-Mar 2026","Apr-Jun 2026"," "]
[null,null,null,null,null,null,null,null,"m2Q_PerY","Jul-Sep 25",{"$f":"K55&$S53&ActY_m1Y","v":"jul-sep 25"},"okt-dec 25","jan-mar 26","apr-jun 26",{"$f":"O55&$S53&ActY_m1Y","v":"Jul-Sep 25"},"Oct-Dec 25","Jan-Mar 26","Apr-Jun 26",""]
[null,null,1,"¹",null,null,null,null,"m2Q_Per","Jul-Sep",{"$f":"N39","v":"jul-sep"},"okt-dec","jan-mar","apr-jun",{"$f":"R39","v":"Jul-Sep"},"Oct-Dec","Jan-Mar","Apr-Jun",""]
[null,null,2,"²",null,null,null,null,"m2Q_AckPer","Jan-Sep",{"$f":"N40","v":"jan-sep"},"jan-dec","jan-mar","jan-jun",{"$f":"R40","v":"Jan-Sep"},"Jan-Dec","Jan-Mar","Jan-Jun",""]
[null,null,3,"³",null,null,null,"Perioden minus 3Q","m3Q_Qn",2,{"$f":"N41","v":2},3,4,1,{"$f":"R41","v":2},3,4,1,{"$f":"IF(S41=\"\",\"\",S41)","v":""}]
[null,null,4,"⁴",null,null,null,null,"m3Q_Q","Q2",{"$f":"\"Q\"&K57","v":"Q2"},"Q3","Q4","Q1","Q2","Q3","Q4","Q1",""]
[null,null,5,"⁵",null,null,null,null,"m3Q_Q_Year","Q2 2025",{"$f":"K58&$S59&ActYear_m1Y","v":"Q2 2025"},{"$f":"K43","v":"Q3 2025"},"Q4 2025","Q1 2026",{"$f":"O58&$S59&ActYear_m1Y","v":"Q2 2025"},{"$f":"O43","v":"Q3 2025"},{"$f":"P43","v":"Q4 2025"},{"$f":"Q43","v":"Q1 2026"}," "]
[null,null,6,"⁶",null,null,null,null,"m3Q_Q_Y","Q2 25",{"$f":"K58&$S60&ActY_m1Y","v":"Q2 25"},"Q3 25","Q4 25","Q1 26",{"$f":"O58&$S60&ActY_m1Y","v":"Q2 25"},{"$f":"O44","v":"Q3 25"},{"$f":"P43","v":"Q4 2025"},{"$f":"Q43","v":"Q1 2026"}," "]
[null,null,7,"⁷",null,null,null,null,"m3Q_Qn_Year","2 2025",{"$f":"K57&$S61&ActYear_m1Y","v":"2 2025"},"3 2025","4 2025","1 2026",{"$f":"O57&$S61&ActYear_m1Y","v":"2 2025"},"3 2025",{"$f":"P45","v":"4 2025"},"1 2026"," "]
[null,null,8,"⁸",null,null,null,null,"m3Q_Qn_Y","2 25",{"$f":"K57&$S62&ActY_m1Y","v":"2 25"},"3 25","4 25","1 26",{"$f":"O57&$S62&ActY_m1Y","v":"2 25"},"3 25","4 25","1 26"," "]
[null,null,9,"⁹",null,null,null,null,"m3Q_Mon","06",{"$f":"N47","v":"06"},"09","12","03",{"$f":"R47","v":"06"},"09","12","03",""]
[null,null,null,null,null,null,null,null,"m3Q_YearMonth","2025 06",{"$f":"ActYear_m1Y&$S64&K63","v":"2025 06"},"2025 09","2025 12","2026 03",{"$f":"ActYear_m1Y&$S64&O63","v":"2025 06"},"2025 09","2025 12","2026 03"," "]
[null,null,"BR_Dat_Txt_Start",{"$f":"ActYear&\"-01-01\"","v":"2026-01-01"},null,null,null,null,"m3Q_QBrMDay","30 Jun",{"$f":"N49","v":"30 jun"},"30 sep","31 dec","31 mar",{"$f":"R49","v":"30 Jun"},"30 Sep","31 Dec","31 Mar",""]
[null,null,"BR_Dat_Txt_Slut",{"$f":"ActYear&\"-\"&ActMon&\"-\"&LEFT(ActQBrMDay,2)","v":"2026-03-31"},null,null,null,null,"m3Q_QBrDate","2025-06-30",{"$f":"EOMONTH(DATE(ActYear_m1Y,K63,1),0)","v":"2025-06-30"},"2025-09-30","2025-12-31","2026-03-31",{"$f":"EOMONTH(DATE(ActYear_m1Y,O63,1),0)","v":"2025-06-30"},"2025-09-30","2025-12-31","2026-03-31",""]
[null,null,"BR_Dat_Txt_Start_1Y",{"$f":"ActYear_m1Y&\"-01-01\"","v":"2025-01-01"},null,null,null,null,"m3Q_QBrDateYear","30 Jun 2025",{"$f":"K65&$S67&ActYear_m1Y","v":"30 jun 2025"},"30 sep 2025","31 dec 2025","31 mar 2026",{"$f":"O65&$S67&ActYear_m1Y","v":"30 Jun 2025"},"30 Sep 2025","31 Dec 2025","31 Mar 2026"," "]
[null,null,"BR_Dat_Txt_Slut_1Y",{"$f":"ActYear_m1Y&\"-\"&ActMon&\"-\"&LEFT(ActQBrMDay,2)","v":"2025-03-31"},null,null,null,null,"m3Q_QBrDateY","30 Jun 25",{"$f":"K65&$S68&ActY_m1Y","v":"30 jun 25"},"30 sep 25","31 dec 25","31 mar 26",{"$f":"O65&$S68&ActY_m1Y","v":"30 Jun 25"},"30 Sep 25","31 Dec 25","31 Mar 26"," "]
[null,null,null,null,null,null,null,null,"m3Q_PerYear","Apr-Jun 2025",{"$f":"K71&$S69&ActYear_m1Y","v":"apr-jun 2025"},"jul-sep 2025","okt-dec 2025","jan-mar 2026",{"$f":"O71&$S69&ActYear_m1Y","v":"Apr-Jun 2025"},"Jul-Sep 2025","Oct-Dec 2025","Jan-Mar 2026"," "]
[null,null,null,null,null,null,null,null,"m3Q_PerY","Apr-Jun 25",{"$f":"K71&$S69&ActY_m1Y","v":"apr-jun 25"},"jul-sep 25","okt-dec 25","jan-mar 26",{"$f":"O71&$S69&ActY_m1Y","v":"Apr-Jun 25"},"Jul-Sep 25","Oct-Dec 25","Jan-Mar 26",""]
[null,null,"RowHeight1",1,1,null,null,null,"m3Q_Per",{"$f":"INDEX(K71:R71,,SelectIdx)","v":"Apr-Jun"},{"$f":"N55","v":"apr-jun"},"jul-sep","okt-dec","jan-mar",{"$f":"R55","v":"Apr-Jun"},"Jul-Sep","Oct-Dec","Jan-Mar",""]
[null,null,"RowHeight2",2,2,null,null,null,"m3Q_AckPer","Jan-Jun",{"$f":"N56","v":"jan-jun"},"jan-sep","jan-dec","jan-mar",{"$f":"R56","v":"Jan-Jun"},"Jan-Sep","Jan-Dec","Jan-Mar",""]
[null,null,"RowHeight3",3,2,null,null,"Perioden minus 4Q","m4Q_Qn",1,{"$f":"N57","v":1},2,3,4,{"$f":"R57","v":1},2,3,4,""]
[null,null,"RowHeight4",4,3,null,null,null,"m4Q_Q","Q1",{"$f":"\"Q\"&K73","v":"Q1"},"Q2","Q3","Q4","Q1","Q2","Q3","Q4",""]
[null,null,"RowHeightIdx",{"$f":"INDEX(E71:E74,MATCH(Q_No,D71:D74,0))","v":1},null,null,null,null,"m4Q_Q_Year","Q1 2025",{"$f":"K74&$S75&ActYear_m1Y","v":"Q1 2025"},{"$f":"K59","v":"Q2 2025"},"Q3 2025","Q4 2025",{"$f":"O74&$S75&ActYear_m1Y","v":"Q1 2025"},{"$f":"O59","v":"Q2 2025"},{"$f":"P59","v":"Q3 2025"},{"$f":"Q59","v":"Q4 2025"}," "]
[null,null,null,null,null,null,null,null,"m4Q_Q_Y","Q1 25",{"$f":"K74&$S76&ActY_m1Y","v":"Q1 25"},"Q2 25","Q3 25","Q4 25",{"$f":"O74&$S76&ActY_m1Y","v":"Q1 25"},{"$f":"O60","v":"Q2 25"},{"$f":"P59","v":"Q3 2025"},{"$f":"Q59","v":"Q4 2025"}," "]
[null,null,"Wd_Sidft_Txt_1","1 jan - ","1 Jan - ",{"$f":"IF(INDEX($D77:$E77,,SelLngNo)=0,\"\",INDEX($D77:$E77,,SelLngNo))&ActQBrDateYear","v":"1 Jan - 31 Mar 2026"},null,null,"m4Q_Qn_Year","1 2025",{"$f":"K73&$S77&ActYear_m1Y","v":"1 2025"},"2 2025","3 2025","4 2025",{"$f":"O73&$S77&ActYear_m1Y","v":"1 2025"},"2 2025",{"$f":"P61","v":"3 2025"},"4 2025"," "]
[null,null,null,null,null,null,null,null,"m4Q_Qn_Y","1 25",{"$f":"K73&$S78&ActY_m1Y","v":"1 25"},"2 25","3 25","4 25",{"$f":"O73&$S78&ActY_m1Y","v":"1 25"},"2 25","3 25","4 25"," "]
[null,null,null,null,null,null,null,null,"m4Q_Mon","03",{"$f":"N63","v":"03"},"06","09","12",{"$f":"R63","v":"03"},"06","09","12",""]
[null,null,null,null,null,null,null,null,"m4Q_YearMonth","2025 03",{"$f":"ActYear_m1Y&$S80&K79","v":"2025 03"},"2025 06","2025 09","2025 12",{"$f":"ActYear_m1Y&$S80&O79","v":"2025 03"},"2025 06","2025 09","2025 12"," "]
[null,null,null,null,null,null,null,null,"m4Q_QBrMDay","31 Mar",{"$f":"N65","v":"31 mar"},"30 jun","30 sep","31 dec",{"$f":"R65","v":"31 Mar"},"30 Jun","30 Sep","31 Dec",""]
[null,null,null,null,null,null,null,null,"m4Q_QBrDate","2025-03-31",{"$f":"EOMONTH(DATE(ActYear_m1Y,K79,1),0)","v":"2025-03-31"},"2025-06-30","2025-09-30","2025-12-31",{"$f":"EOMONTH(DATE(ActYear_m1Y,O79,1),0)","v":"2025-03-31"},"2025-06-30","2025-09-30","2025-12-31",""]
[null,null,null,null,null,null,null,null,"m4Q_QBrDateYear","31 Mar 2025",{"$f":"K81&$S83&ActYear_m1Y","v":"31 mar 2025"},"30 jun 2025","30 sep 2025","31 dec 2025",{"$f":"O81&$S83&ActYear_m1Y","v":"31 Mar 2025"},"30 Jun 2025","30 Sep 2025","31 Dec 2025"," "]
[null,null,null,null,null,null,null,null,"m4Q_QBrDateY","31 Mar 25",{"$f":"K81&$S84&ActY_m1Y","v":"31 mar 25"},"30 jun 25","30 sep 25","31 dec 25",{"$f":"O81&$S84&ActY_m1Y","v":"31 Mar 25"},"30 Jun 25","30 Sep 25","31 Dec 25"," "]
[null,null,null,null,null,null,null,null,"m4Q_PerYear","Jan-Mar 2025",{"$f":"K87&$S85&ActYear_m1Y","v":"jan-mar 2025"},"apr-jun 2025","jul-sep 2025","okt-dec 2025",{"$f":"O87&$S85&ActYear_m1Y","v":"Jan-Mar 2025"},"Apr-Jun 2025","Jul-Sep 2025","Oct-Dec 2025"," "]
[null,null,null,null,null,null,null,null,"m4Q_PerY","Jan-Mar 25",{"$f":"K87&$S85&ActY_m1Y","v":"jan-mar 25"},"apr-jun 25","jul-sep 25","okt-dec 25",{"$f":"O87&$S85&ActY_m1Y","v":"Jan-Mar 25"},"Apr-Jun 25","Jul-Sep 25","Oct-Dec 25",""]
[null,null,null,null,null,null,null,null,"m4Q_Per","Jan-Mar",{"$f":"N71","v":"jan-mar"},"apr-jun","jul-sep","okt-dec",{"$f":"R71","v":"Jan-Mar"},"Apr-Jun","Jul-Sep","Oct-Dec",""]
[null,null,null,null,null,null,null,null,"m4Q_AckPer","Jan-Mar",{"$f":"N72","v":"jan-mar"},"jan-jun","jan-sep","jan-dec",{"$f":"R72","v":"Jan-Mar"},"Jan-Jun","Jan-Sep","Jan-Dec",""]
[null,null,null,null,null,null,null,"Perioden minus 5Q","m5Q_Qn",4,{"$f":"N73","v":4},1,2,3,{"$f":"R73","v":4},1,2,3,{"$f":"IF(S73=\"\",\"\",S73)","v":""}]
[null,null,null,null,null,null,null,null,"m5Q_Q","Q4",{"$f":"\"Q\"&K89","v":"Q4"},"Q1","Q2","Q3","Q4","Q1","Q2","Q3",""]
[null,null,null,null,null,null,null,null,"m5Q_Q_Year","Q4 2024",{"$f":"K90&$S91&ActYear_m2Y","v":"Q4 2024"},{"$f":"K75","v":"Q1 2025"},"Q2 2025","Q3 2025",{"$f":"O90&$S91&ActYear_m2Y","v":"Q4 2024"},{"$f":"O75","v":"Q1 2025"},{"$f":"P75","v":"Q2 2025"},{"$f":"Q75","v":"Q3 2025"}," "]
[null,null,null,null,null,null,null,null,"m5Q_Q_Y","Q4 24",{"$f":"K90&$S92&ActY_m2Y","v":"Q4 24"},"Q1 25","Q2 25","Q3 25",{"$f":"O90&$S92&ActY_m2Y","v":"Q4 24"},{"$f":"O76","v":"Q1 25"},{"$f":"P75","v":"Q2 2025"},{"$f":"Q75","v":"Q3 2025"}," "]
[null,null,null,null,null,null,null,null,"m5Q_Qn_Year","4 2024",{"$f":"K89&$S93&ActYear_m2Y","v":"4 2024"},"1 2025","2 2025","3 2025",{"$f":"O89&$S93&ActYear_m2Y","v":"4 2024"},"1 2025",{"$f":"P77","v":"2 2025"},"3 2025"," "]
[null,null,null,null,null,null,null,null,"m5Q_Qn_Y","4 24",{"$f":"K89&$S94&ActY_m2Y","v":"4 24"},"1 25","2 25","3 25",{"$f":"O89&$S94&ActY_m2Y","v":"4 24"},"1 25","2 25","3 25"," "]
[null,null,null,null,null,null,null,null,"m5Q_Mon","12",{"$f":"N79","v":"12"},"03","06","09",{"$f":"R79","v":"12"},"03","06","09",""]
[null,null,null,null,null,null,null,null,"m5Q_YearMonth","2024 12",{"$f":"ActYear_m2Y&$S96&K95","v":"2024 12"},"2025 03","2025 06","2025 09",{"$f":"ActYear_m2Y&$S96&O95","v":"2024 12"},"2025 03","2025 06","2025 09"," "]
[null,null,null,null,null,null,null,null,"m5Q_QBrMDay","31 Dec",{"$f":"N81","v":"31 dec"},"31 mar","30 jun","30 sep",{"$f":"R81","v":"31 Dec"},"31 Mar","30 Jun","30 Sep",""]
[null,null,null,null,null,null,null,null,"m5Q_QBrDate","2024-12-31",{"$f":"EOMONTH(DATE(ActYear_m2Y,K95,1),0)","v":"2024-12-31"},"2025-03-31","2025-06-30","2025-09-30",{"$f":"EOMONTH(DATE(ActYear_m2Y,O95,1),0)","v":"2024-12-31"},"2025-03-31","2025-06-30","2025-09-30",""]
[null,null,null,null,null,null,null,null,"m5Q_QBrDateYear","31 Dec 2024",{"$f":"K97&$S99&ActYear_m2Y","v":"31 dec 2024"},"31 mar 2025","30 jun 2025","30 sep 2025",{"$f":"O97&$S99&ActYear_m2Y","v":"31 Dec 2024"},"31 Mar 2025","30 Jun 2025","30 Sep 2025"," "]
[null,null,null,null,null,null,null,null,"m5Q_QBrDateY","31 Dec 24",{"$f":"K97&$S100&ActY_m2Y","v":"31 dec 24"},"31 mar 25","30 jun 25","30 sep 25",{"$f":"O97&$S100&ActY_m2Y","v":"31 Dec 24"},"31 Mar 25","30 Jun 25","30 Sep 25"," "]
[null,null,null,null,null,null,null,null,"m5Q_PerYear","Oct-Dec 2024",{"$f":"K103&$S101&ActYear_m2Y","v":"okt-dec 2024"},"jan-mar 2025","apr-jun 2025","jul-sep 2025",{"$f":"O103&$S101&ActYear_m2Y","v":"Oct-Dec 2024"},"Jan-Mar 2025","Apr-Jun 2025","Jul-Sep 2025"," "]
[null,null,null,null,null,null,null,null,"m5Q_PerY","Oct-Dec 24",{"$f":"K103&$S101&ActY_m2Y","v":"okt-dec 24"},"jan-mar 25","apr-jun 25","jul-sep 25",{"$f":"O103&$S101&ActY_m2Y","v":"Oct-Dec 24"},"Jan-Mar 25","Apr-Jun 25","Jul-Sep 25",""]
[null,null,null,null,null,null,null,null,"m5Q_Per",{"$f":"INDEX(K103:R103,,SelectIdx)","v":"Oct-Dec"},{"$f":"N87","v":"okt-dec"},"jan-mar","apr-jun","jul-sep",{"$f":"R87","v":"Oct-Dec"},"Jan-Mar","Apr-Jun","Jul-Sep",""]
[null,null,null,null,null,null,null,null,"m5Q_AckPer","Jan-Dec",{"$f":"N88","v":"jan-dec"},"jan-mar","jan-jun","jan-sep",{"$f":"R88","v":"Jan-Dec"},"Jan-Mar","Jan-Jun","Jan-Sep",""]
[null,null,null,null,null,null,null,"Perioden minus 6Q","m6Q_Qn",3,{"$f":"N89","v":3},4,1,2,{"$f":"R89","v":3},4,1,2,""]
[null,null,null,null,null,null,null,null,"m6Q_Q","Q3",{"$f":"\"Q\"&K105","v":"Q3"},"Q4","Q1","Q2","Q3","Q4","Q1","Q2",""]
[null,null,null,null,null,null,null,null,"m6Q_Q_Year","Q3 2024",{"$f":"K106&$S107&ActYear_m2Y","v":"Q3 2024"},{"$f":"K91","v":"Q4 2024"},"Q1 2025","Q2 2025",{"$f":"O106&$S107&ActYear_m2Y","v":"Q3 2024"},{"$f":"O91","v":"Q4 2024"},{"$f":"P91","v":"Q1 2025"},{"$f":"Q91","v":"Q2 2025"}," "]
[null,null,null,null,null,null,null,null,"m6Q_Q_Y","Q3 24",{"$f":"K106&$S108&ActY_m2Y","v":"Q3 24"},"Q4 24","Q1 25","Q2 25",{"$f":"O106&$S108&ActY_m2Y","v":"Q3 24"},{"$f":"O92","v":"Q4 24"},{"$f":"P91","v":"Q1 2025"},{"$f":"Q91","v":"Q2 2025"}," "]
[null,null,null,null,null,null,null,null,"m6Q_Qn_Year","3 2024",{"$f":"K105&$S109&ActYear_m2Y","v":"3 2024"},"4 2024","1 2025","2 2025",{"$f":"O105&$S109&ActYear_m2Y","v":"3 2024"},"4 2024",{"$f":"P93","v":"1 2025"},"2 2025"," "]
[null,null,null,null,null,null,null,null,"m6Q_Qn_Y","3 24",{"$f":"K105&$S110&ActY_m2Y","v":"3 24"},"4 24","1 25","2 25",{"$f":"O105&$S110&ActY_m2Y","v":"3 24"},"4 24","1 25","2 25"," "]
[null,null,null,null,null,null,null,null,"m6Q_Mon","09",{"$f":"N95","v":"09"},"12","03","06",{"$f":"R95","v":"09"},"12","03","06",""]
[null,null,null,null,null,null,null,null,"m6Q_YearMonth","2024 09",{"$f":"ActYear_m2Y&$S112&K111","v":"2024 09"},"2024 12","2025 03","2025 06",{"$f":"ActYear_m2Y&$S112&O111","v":"2024 09"},"2024 12","2025 03","2025 06"," "]
[null,null,null,null,null,null,null,null,"m6Q_QBrMDay","30 Sep",{"$f":"N97","v":"30 sep"},"31 dec","31 mar","30 jun",{"$f":"R97","v":"30 Sep"},"31 Dec","31 Mar","30 Jun",""]
[null,null,null,null,null,null,null,null,"m6Q_QBrDate","2024-09-30",{"$f":"EOMONTH(DATE(ActYear_m2Y,K111,1),0)","v":"2024-09-30"},"2024-12-31","2025-03-31","2025-06-30",{"$f":"EOMONTH(DATE(ActYear_m2Y,O111,1),0)","v":"2024-09-30"},"2024-12-31","2025-03-31","2025-06-30",""]
[null,null,null,null,null,null,null,null,"m6Q_QBrDateYear","30 Sep 2024",{"$f":"K113&$S115&ActYear_m2Y","v":"30 sep 2024"},"31 dec 2024","31 mar 2025","30 jun 2025",{"$f":"O113&$S115&ActYear_m2Y","v":"30 Sep 2024"},"31 Dec 2024","31 Mar 2025","30 Jun 2025"," "]
[null,null,null,null,null,null,null,null,"m6Q_QBrDateY","30 Sep 24",{"$f":"K113&$S116&ActY_m2Y","v":"30 sep 24"},"31 dec 24","31 mar 25","30 jun 25",{"$f":"O113&$S116&ActY_m2Y","v":"30 Sep 24"},"31 Dec 24","31 Mar 25","30 Jun 25"," "]
[null,null,null,null,null,null,null,null,"m6Q_PerYear","Jul-Sep 2024",{"$f":"K119&$S117&ActYear_m2Y","v":"jul-sep 2024"},"okt-dec 2024","jan-mar 2025","apr-jun 2025",{"$f":"O119&$S117&ActYear_m2Y","v":"Jul-Sep 2024"},"Oct-Dec 2024","Jan-Mar 2025","Apr-Jun 2025"," "]
[null,null,null,null,null,null,null,null,"m6Q_PerY","Jul-Sep 24",{"$f":"K119&$S117&ActY_m2Y","v":"jul-sep 24"},"okt-dec 24","jan-mar 25","apr-jun 25",{"$f":"O119&$S117&ActY_m2Y","v":"Jul-Sep 24"},"Oct-Dec 24","Jan-Mar 25","Apr-Jun 25",""]
[null,null,null,null,null,null,null,null,"m6Q_Per","Jul-Sep",{"$f":"N103","v":"jul-sep"},"okt-dec","jan-mar","apr-jun",{"$f":"R103","v":"Jul-Sep"},"Oct-Dec","Jan-Mar","Apr-Jun",""]
[null,null,null,null,null,null,null,null,"m6Q_AckPer","Jan-Sep",{"$f":"N104","v":"jan-sep"},"jan-dec","jan-mar","jan-jun",{"$f":"R104","v":"Jan-Sep"},"Jan-Dec","Jan-Mar","Jan-Jun",""]
[null,null,null,null,null,null,null,"Perioden minus 7Q","m7Q_Qn",2,{"$f":"N105","v":2},3,4,1,{"$f":"R105","v":2},3,4,1,{"$f":"IF(S105=\"\",\"\",S105)","v":""}]
[null,null,null,null,null,null,null,null,"m7Q_Q","Q2",{"$f":"\"Q\"&K121","v":"Q2"},"Q3","Q4","Q1","Q2","Q3","Q4","Q1",""]
[null,null,null,null,null,null,null,null,"m7Q_Q_Year","Q2 2024",{"$f":"K122&$S123&ActYear_m2Y","v":"Q2 2024"},{"$f":"K107","v":"Q3 2024"},"Q4 2024","Q1 2025",{"$f":"O122&$S123&ActYear_m2Y","v":"Q2 2024"},{"$f":"O107","v":"Q3 2024"},{"$f":"P107","v":"Q4 2024"},{"$f":"Q107","v":"Q1 2025"}," "]
[null,null,null,null,null,null,null,null,"m7Q_Q_Y","Q2 24",{"$f":"K122&$S124&ActY_m2Y","v":"Q2 24"},"Q3 24","Q4 24","Q1 25",{"$f":"O122&$S124&ActY_m2Y","v":"Q2 24"},{"$f":"O108","v":"Q3 24"},{"$f":"P107","v":"Q4 2024"},{"$f":"Q107","v":"Q1 2025"}," "]
[null,null,null,null,null,null,null,null,"m7Q_Qn_Year","2 2024",{"$f":"K121&$S125&ActYear_m2Y","v":"2 2024"},"3 2024","4 2024","1 2025",{"$f":"O121&$S125&ActYear_m2Y","v":"2 2024"},"3 2024",{"$f":"P109","v":"4 2024"},"1 2025"," "]
[null,null,null,null,null,null,null,null,"m7Q_Qn_Y","2 24",{"$f":"K121&$S126&ActY_m2Y","v":"2 24"},"3 24","4 24","1 25",{"$f":"O121&$S126&ActY_m2Y","v":"2 24"},"3 24","4 24","1 25"," "]
[null,null,null,null,null,null,null,null,"m7Q_Mon","06",{"$f":"N111","v":"06"},"09","12","03",{"$f":"R111","v":"06"},"09","12","03",""]
[null,null,null,null,null,null,null,null,"m7Q_YearMonth","2024 06",{"$f":"ActYear_m2Y&$S128&K127","v":"2024 06"},"2024 09","2024 12","2025 03",{"$f":"ActYear_m2Y&$S128&O127","v":"2024 06"},"2024 09","2024 12","2025 03"," "]
[null,null,null,null,null,null,null,null,"m7Q_QBrMDay","30 Jun",{"$f":"N113","v":"30 jun"},"30 sep","31 dec","31 mar",{"$f":"R113","v":"30 Jun"},"30 Sep","31 Dec","31 Mar",""]
[null,null,null,null,null,null,null,null,"m7Q_QBrDate","2024-06-30",{"$f":"EOMONTH(DATE(ActYear_m2Y,K127,1),0)","v":"2024-06-30"},"2024-09-30","2024-12-31","2025-03-31",{"$f":"EOMONTH(DATE(ActYear_m2Y,O127,1),0)","v":"2024-06-30"},"2024-09-30","2024-12-31","2025-03-31",""]
[null,null,null,null,null,null,null,null,"m7Q_QBrDateYear","30 Jun 2024",{"$f":"K129&$S131&ActYear_m2Y","v":"30 jun 2024"},"30 sep 2024","31 dec 2024","31 mar 2025",{"$f":"O129&$S131&ActYear_m2Y","v":"30 Jun 2024"},"30 Sep 2024","31 Dec 2024","31 Mar 2025"," "]
[null,null,null,null,null,null,null,null,"m7Q_QBrDateY","30 Jun 24",{"$f":"K129&$S132&ActY_m2Y","v":"30 jun 24"},"30 sep 24","31 dec 24","31 mar 25",{"$f":"O129&$S132&ActY_m2Y","v":"30 Jun 24"},"30 Sep 24","31 Dec 24","31 Mar 25"," "]
[null,null,null,null,null,null,null,null,"m7Q_PerYear","Apr-Jun 2024",{"$f":"K135&$S133&ActYear_m2Y","v":"apr-jun 2024"},"jul-sep 2024","okt-dec 2024","jan-mar 2025",{"$f":"O135&$S133&ActYear_m2Y","v":"Apr-Jun 2024"},"Jul-Sep 2024","Oct-Dec 2024","Jan-Mar 2025"," "]
[null,null,null,null,null,null,null,null,"m7Q_PerY","Apr-Jun 24",{"$f":"K135&$S133&ActY_m2Y","v":"apr-jun 24"},"jul-sep 24","okt-dec 24","jan-mar 25",{"$f":"O135&$S133&ActY_m2Y","v":"Apr-Jun 24"},"Jul-Sep 24","Oct-Dec 24","Jan-Mar 25",""]
[null,null,null,null,null,null,null,null,"m7Q_Per",{"$f":"INDEX(K135:R135,,SelectIdx)","v":"Apr-Jun"},{"$f":"N119","v":"apr-jun"},"jul-sep","okt-dec","jan-mar",{"$f":"R119","v":"Apr-Jun"},"Jul-Sep","Oct-Dec","Jan-Mar",""]
[null,null,null,null,null,null,null,null,"m7Q_AckPer","Jan-Jun",{"$f":"N120","v":"jan-jun"},"jan-sep","jan-dec","jan-mar",{"$f":"R120","v":"Jan-Jun"},"Jan-Sep","Jan-Dec","Jan-Mar",""]
[null,null,null,null,null,null,null,"Perioden minus 8Q","m8Q_Qn",1,{"$f":"N121","v":1},2,3,4,{"$f":"R121","v":1},2,3,4,""]
[null,null,null,null,null,null,null,null,"m8Q_Q","Q1",{"$f":"\"Q\"&K137","v":"Q1"},"Q2","Q3","Q4","Q1","Q2","Q3","Q4",""]
[null,null,null,null,null,null,null,null,"m8Q_Q_Year","Q1 2024",{"$f":"K138&$S139&ActYear_m2Y","v":"Q1 2024"},{"$f":"K123","v":"Q2 2024"},"Q3 2024","Q4 2024",{"$f":"O138&$S139&ActYear_m2Y","v":"Q1 2024"},{"$f":"O123","v":"Q2 2024"},{"$f":"P123","v":"Q3 2024"},{"$f":"Q123","v":"Q4 2024"}," "]
[null,null,null,null,null,null,null,null,"m8Q_Q_Y","Q1 24",{"$f":"K138&$S140&ActY_m2Y","v":"Q1 24"},"Q2 24","Q3 24","Q4 24",{"$f":"O138&$S140&ActY_m2Y","v":"Q1 24"},{"$f":"O124","v":"Q2 24"},{"$f":"P123","v":"Q3 2024"},{"$f":"Q123","v":"Q4 2024"}," "]
[null,null,null,null,null,null,null,null,"m8Q_Qn_Year","1 2024",{"$f":"K137&$S141&ActYear_m2Y","v":"1 2024"},"2 2024","3 2024","4 2024",{"$f":"O137&$S141&ActYear_m2Y","v":"1 2024"},"2 2024",{"$f":"P125","v":"3 2024"},"4 2024"," "]
[null,null,null,null,null,null,null,null,"m8Q_Qn_Y","1 24",{"$f":"K137&$S142&ActY_m2Y","v":"1 24"},"2 24","3 24","4 24",{"$f":"O137&$S142&ActY_m2Y","v":"1 24"},"2 24","3 24","4 24"," "]
[null,null,null,null,null,null,null,null,"m8Q_Mon","03",{"$f":"N127","v":"03"},"06","09","12",{"$f":"R127","v":"03"},"06","09","12",""]
[null,null,null,null,null,null,null,null,"m8Q_YearMonth","2024 03",{"$f":"ActYear_m2Y&$S144&K143","v":"2024 03"},"2024 06","2024 09","2024 12",{"$f":"ActYear_m2Y&$S144&O143","v":"2024 03"},"2024 06","2024 09","2024 12"," "]
[null,null,null,null,null,null,null,null,"m8Q_QBrMDay","31 Mar",{"$f":"N129","v":"31 mar"},"30 jun","30 sep","31 dec",{"$f":"R129","v":"31 Mar"},"30 Jun","30 Sep","31 Dec",""]
[null,null,null,null,null,null,null,null,"m8Q_QBrDate","2024-03-31",{"$f":"EOMONTH(DATE(ActYear_m2Y,K143,1),0)","v":"2024-03-31"},"2024-06-30","2024-09-30","2024-12-31",{"$f":"EOMONTH(DATE(ActYear_m2Y,O143,1),0)","v":"2024-03-31"},"2024-06-30","2024-09-30","2024-12-31",""]
[null,null,null,null,null,null,null,null,"m8Q_QBrDateYear","31 Mar 2024",{"$f":"K145&$S147&ActYear_m2Y","v":"31 mar 2024"},"30 jun 2024","30 sep 2024","31 dec 2024",{"$f":"O145&$S147&ActYear_m2Y","v":"31 Mar 2024"},"30 Jun 2024","30 Sep 2024","31 Dec 2024"," "]
[null,null,null,null,null,null,null,null,"m8Q_QBrDateY","31 Mar 24",{"$f":"K145&$S148&ActY_m2Y","v":"31 mar 24"},"30 jun 24","30 sep 24","31 dec 24",{"$f":"O145&$S148&ActY_m2Y","v":"31 Mar 24"},"30 Jun 24","30 Sep 24","31 Dec 24"," "]
[null,null,null,null,null,null,null,null,"m8Q_PerYear","Jan-Mar 2024",{"$f":"K151&$S149&ActYear_m2Y","v":"jan-mar 2024"},"apr-jun 2024","jul-sep 2024","okt-dec 2024",{"$f":"O151&$S149&ActYear_m2Y","v":"Jan-Mar 2024"},"Apr-Jun 2024","Jul-Sep 2024","Oct-Dec 2024"," "]
[null,null,null,null,null,null,null,null,"m8Q_PerY","Jan-Mar 24",{"$f":"K151&$S149&ActY_m2Y","v":"jan-mar 24"},"apr-jun 24","jul-sep 24","okt-dec 24",{"$f":"O151&$S149&ActY_m2Y","v":"Jan-Mar 24"},"Apr-Jun 24","Jul-Sep 24","Oct-Dec 24",""]
[null,null,null,null,null,null,null,null,"m8Q_Per","Jan-Mar",{"$f":"N135","v":"jan-mar"},"apr-jun","jul-sep","okt-dec",{"$f":"R135","v":"Jan-Mar"},"Apr-Jun","Jul-Sep","Oct-Dec",""]
[null,null,null,null,null,null,null,null,"m8Q_AckPer","Jan-Mar",{"$f":"N136","v":"jan-mar"},"jan-jun","jan-sep","jan-dec",{"$f":"R136","v":"Jan-Mar"},"Jan-Jun","Jan-Sep","Jan-Dec",""]
[null,null,null,null,null,null,null,"Perioden minus 9Q","m9Q_Qn",4,{"$f":"N137","v":4},1,2,3,{"$f":"R137","v":4},1,2,3,{"$f":"IF(S137=\"\",\"\",S137)","v":""}]
[null,null,null,null,null,null,null,null,"m9Q_Q","Q4",{"$f":"\"Q\"&K153","v":"Q4"},"Q1","Q2","Q3","Q4","Q1","Q2","Q3",""]
[null,null,null,null,null,null,null,null,"m9Q_Q_Year","Q4 2023",{"$f":"K154&$S155&ActYear_m3Y","v":"Q4 2023"},{"$f":"K139","v":"Q1 2024"},"Q2 2024","Q3 2024",{"$f":"O154&$S155&ActYear_m3Y","v":"Q4 2023"},{"$f":"O139","v":"Q1 2024"},{"$f":"P139","v":"Q2 2024"},{"$f":"Q139","v":"Q3 2024"}," "]
[null,null,null,null,null,null,null,null,"m9Q_Q_Y","Q4 23",{"$f":"K154&$S156&ActY_m3Y","v":"Q4 23"},"Q1 24","Q2 24","Q3 24",{"$f":"O154&$S156&ActY_m3Y","v":"Q4 23"},{"$f":"O140","v":"Q1 24"},{"$f":"P139","v":"Q2 2024"},{"$f":"Q139","v":"Q3 2024"}," "]
[null,null,null,null,null,null,null,null,"m9Q_Qn_Year","4 2023",{"$f":"K153&$S157&ActYear_m3Y","v":"4 2023"},"1 2024","2 2024","3 2024",{"$f":"O153&$S157&ActYear_m3Y","v":"4 2023"},"1 2024",{"$f":"P141","v":"2 2024"},"3 2024"," "]
[null,null,null,null,null,null,null,null,"m9Q_Qn_Y","4 23",{"$f":"K153&$S158&ActY_m3Y","v":"4 23"},"1 24","2 24","3 24",{"$f":"O153&$S158&ActY_m3Y","v":"4 23"},"1 24","2 24","3 24"," "]
[null,null,null,null,null,null,null,null,"m9Q_Mon","12",{"$f":"N143","v":"12"},"03","06","09",{"$f":"R143","v":"12"},"03","06","09",""]
[null,null,null,null,null,null,null,null,"m9Q_YearMonth","2023 12",{"$f":"ActYear_m3Y&$S160&K159","v":"2023 12"},"2024 03","2024 06","2024 09",{"$f":"ActYear_m3Y&$S160&O159","v":"2023 12"},"2024 03","2024 06","2024 09"," "]
[null,null,null,null,null,null,null,null,"m9Q_QBrMDay","31 Dec",{"$f":"N145","v":"31 dec"},"31 mar","30 jun","30 sep",{"$f":"R145","v":"31 Dec"},"31 Mar","30 Jun","30 Sep",""]
[null,null,null,null,null,null,null,null,"m9Q_QBrDate","2023-12-31",{"$f":"EOMONTH(DATE(ActYear_m3Y,K159,1),0)","v":"2023-12-31"},"2024-03-31","2024-06-30","2024-09-30",{"$f":"EOMONTH(DATE(ActYear_m3Y,O159,1),0)","v":"2023-12-31"},"2024-03-31","2024-06-30","2024-09-30",""]
[null,null,null,null,null,null,null,null,"m9Q_QBrDateYear","31 Dec 2023",{"$f":"K161&$S163&ActYear_m3Y","v":"31 dec 2023"},"31 mar 2024","30 jun 2024","30 sep 2024",{"$f":"O161&$S163&ActYear_m3Y","v":"31 Dec 2023"},"31 Mar 2024","30 Jun 2024","30 Sep 2024"," "]
[null,null,null,null,null,null,null,null,"m9Q_QBrDateY","31 Dec 23",{"$f":"K161&$S164&ActY_m3Y","v":"31 dec 23"},"31 mar 24","30 jun 24","30 sep 24",{"$f":"O161&$S164&ActY_m3Y","v":"31 Dec 23"},"31 Mar 24","30 Jun 24","30 Sep 24"," "]
[null,null,null,null,null,null,null,null,"m9Q_PerYear","Oct-Dec 2023",{"$f":"K167&$S165&ActYear_m3Y","v":"okt-dec 2023"},"jan-mar 2024","apr-jun 2024","jul-sep 2024",{"$f":"O167&$S165&ActYear_m3Y","v":"Oct-Dec 2023"},"Jan-Mar 2024","Apr-Jun 2024","Jul-Sep 2024"," "]
[null,null,null,null,null,null,null,null,"m9Q_PerY","Oct-Dec 23",{"$f":"K167&$S165&ActY_m3Y","v":"okt-dec 23"},"jan-mar 24","apr-jun 24","jul-sep 24",{"$f":"O167&$S165&ActY_m3Y","v":"Oct-Dec 23"},"Jan-Mar 24","Apr-Jun 24","Jul-Sep 24",""]
[null,null,null,null,null,null,null,null,"m9Q_Per",{"$f":"INDEX(K167:R167,,SelectIdx)","v":"Oct-Dec"},{"$f":"N151","v":"okt-dec"},"jan-mar","apr-jun","jul-sep",{"$f":"R151","v":"Oct-Dec"},"Jan-Mar","Apr-Jun","Jul-Sep",""]
[null,null,null,null,null,null,null,null,"m9Q_AckPer","Jan-Dec",{"$f":"N152","v":"jan-dec"},"jan-mar","jan-jun","jan-sep",{"$f":"R152","v":"Jan-Dec"},"Jan-Mar","Jan-Jun","Jan-Sep",""]
[]
[null,null,null,null,null,null,null,"Perioden minus 1 Year","m1Y_ActQn",{"$f":"INDEX(K170:R170,,SelectIdx)","v":1},1,2,3,4,1,2,3,4,{"$f":"IF(S153=\"\",\"\",S153)","v":""}]
[null,null,null,null,null,null,null,null,"m1Y_ActQ","Q1",{"$f":"\"Q\"&K170","v":"Q1"},"Q2","Q3","Q4","Q1","Q2","Q3","Q4",""]
[null,null,null,null,null,null,null,null,"m1Y_ActQ_Year","Q1 2025",{"$f":"K171&$S11&ActYear_m1Y","v":"Q1 2025"},"Q2 2025","Q3 2025","Q4 2025","Q1 2025","Q2 2025","Q3 2025","Q4 2025"," "]
[null,null,null,null,null,null,null,null,"m1Y_ActQ_Y","Q1 25",{"$f":"K171&$S12&ActY_m1Y","v":"Q1 25"},"Q2 25","Q3 25","Q4 25","Q1 25","Q2 25","Q3 25","Q4 25"," "]
[null,null,null,null,null,null,null,null,"m1Y_ActQn_Year","1 2025",{"$f":"K170&$S13&ActYear_m1Y","v":"1 2025"},"2 2025","3 2025","4 2025","1 2025","2 2025","3 2025","4 2025"," "]
[null,null,null,null,null,null,null,null,"m1Y_ActQn_Y","1 25",{"$f":"K170&$S14&ActY_m1Y","v":"1 25"},"2 25","3 25","4 25","1 25","2 25","3 25","4 25"," "]
[null,null,null,null,null,null,null,null,"m1Y_ActMon","03","03","06","09","12","03","06","09","12",""]
[null,null,null,null,null,null,null,null,"m1Y_ActYearMonth","2025 03",{"$f":"ActYear_m1Y&$S16&K176","v":"2025 03"},"2025 06","2025 09","2025 12","2025 03","2025 06","2025 09","2025 12"," "]
[null,null,null,null,null,null,null,null,"m1Y_ActQBrMDay","31 Mar","31 mar","30 jun","30 sep","31 dec","31 Mar","30 Jun","30 Sep","31 Dec",""]
[null,null,null,null,null,null,null,null,"m1Y_ActQBrDate","2025-03-31",{"$f":"EOMONTH(DATE(ActYear_m1Y,K176,1),0)","v":"2025-03-31"},"2025-06-30","2025-09-30","2025-12-31","2025-03-31","2025-06-30","2025-09-30","2025-12-31",""]
[null,null,null,null,null,null,null,null,"m1Y_ActQBrDateYear","31 Mar 2025",{"$f":"K178&$S19&ActYear_m1Y","v":"31 mar 2025"},"30 jun 2025","30 sep 2025","31 dec 2025","31 Mar 2025","30 Jun 2025","30 Sep 2025","31 Dec 2025"," "]
[null,null,null,null,null,null,null,null,"m1Y_ActQBrDateY","31 Mar 25",{"$f":"K178&$S20&ActY_m1Y","v":"31 mar 25"},"30 jun 25","30 sep 25","31 dec 25","31 Mar 25","30 Jun 25","30 Sep 25","31 Dec 25"," "]
[null,null,null,null,null,null,null,null,"m1Y_ActPerYear","Jan-Mar 2025",{"$f":"K184&$S21&ActYear_m1Y","v":"jan-mar 2025"},"apr-jun 2025","jul-sep 2025","okt-dec 2025","Jan-Mar 2025","Apr-Jun 2025","Jul-Sep 2025","Oct-Dec 2025"," "]
[null,null,null,null,null,null,null,null,"m1Y_ActPerY","Jan-Mar 25",{"$f":"K184&$S21&ActY_m1Y","v":"jan-mar 25"},"apr-jun 25","jul-sep 25","okt-dec 25","Jan-Mar 25","Apr-Jun 25","Jul-Sep 25","Oct-Dec 25",""]
[null,null,null,null,null,null,null,null,"m1Y_ActPer","Jan-Mar","jan-mar","apr-jun","jul-sep","okt-dec","Jan-Mar","Apr-Jun","Jul-Sep","Oct-Dec",""]
[null,null,null,null,null,null,null,null,"m1Y_ActAckPer","Jan-Mar","jan-mar","jan-jun","jan-sep","jan-dec","Jan-Mar","Jan-Jun","Jan-Sep","Jan-Dec",""]
[]
[null,null,null,null,null,null,null,"Rullande 12 mån",null,{"$f":"INDEX(K187:R187,,SelectIdx)","v":1},1,2,3,4,1,2,3,4,{"$f":"IF(S170=\"\",\"\",S170)","v":""}]
[null,null,null,null,null,null,null,null,"ActQBrDateR12Start",{"$f":"INDEX(K188:R188,,SelectIdx)","v":"1 Apr"},"1 apr","1 jul","1 okt","1 jan","1 Apr","1 Jul","1 Oct","1 Jan",{"$f":"IF(S177=\"\",\"\",S177)","v":" "}]
[null,null,null,null,null,null,null,null,"ActQBrDateR12Slut",{"$f":"INDEX(K189:R189,,SelectIdx)","v":"31 Mar"},{"$f":"K17","v":"31 mar"},"30 jun","30 sep","31 dec","31 Mar","30 Jun","30 Sep","31 Dec",{"$f":"IF(S178=\"\",\"\",S178)","v":""}]
[null,null,null,null,null,null,null,null,"ActQBrDateR12",{"$f":"INDEX(K190:R190,,SelectIdx)","v":"1 Apr 25 - 31 Mar 26"},{"$f":"K188&$S$190&ActY_m1Y&\" - \"&K189&$S$190&ActY","v":"1 apr 25 - 31 mar 26"},{"$f":"L188&$S$190&ActY_m1Y&\" - \"&L189&$S$190&ActY","v":"1 jul 25 - 30 jun 26"},{"$f":"M188&$S$190&ActY_m1Y&\" - \"&M189&$S$190&ActY","v":"1 okt 25 - 30 sep 26"},{"$f":"N188&$S$190&ActY&\" - \"&N189&$S$190&ActY","v":"1 jan 26 - 31 dec 26"},{"$f":"O188&$S$190&ActY_m1Y&\" - \"&O189&$S$190&ActY","v":"1 Apr 25 - 31 Mar 26"},{"$f":"P188&$S$190&ActY_m1Y&\" - \"&P189&$S$190&ActY","v":"1 Jul 25 - 30 Jun 26"},{"$f":"Q188&$S$190&ActY_m1Y&\" - \"&Q189&$S$190&ActY","v":"1 Oct 25 - 30 Sep 26"},{"$f":"R188&$S$190&ActY&\" - \"&R189&$S$190&ActY","v":"1 Jan 26 - 31 Dec 26"},{"$f":"IF(S182=\"\",\"\",S182)","v":" "}]
[null,null,null,null,null,null,null,null,"ActAckPerR12",{"$f":"INDEX(K191:R191,,SelectIdx)","v":"Apr-Mar"},"apr-mar","jul-jun","okt-sep","jan-dec","Apr-Mar","Jul-Jun","Oct-Sep","Jan-Dec",{"$f":"IF(S185=\"\",\"\",S185)","v":""}]

{"sheet":"LanguageAdmin","index":1,"n_rows":243,"n_cols":2,"rows_kept":243,"cut":false,"hidden":true,"merged":[]}
["SWE","ENG"]
["%","%"]
["[Land A]","[Country A]"]
["[Land B]","[Country B]"]
["[Land C] ","[Country C]"]
["[Övrigt, specificera]","[Other, specify]"]
["[Övrigt]","[Other]"]
["[Segment 1]","[Segment 1]"]
["[Segment 2]","[Segment 2]"]
["[Segment 3]","[Segment 3]"]
["[Specificera]","[Specify]"]
["Kundfordringar","Accounts receivable"]
["Förvärv av finansiella anläggningstillgångar","Acquisition of financial assets"]
["Förvärv av dotterföretag ","Acquisition of subsidiaries"]
["Justeringar och elimineringar","Adjustments and eliminations"]
["Justering för poster som inte ingår i kassaflödet","Adjustments for non-cash items"]
["Amortering av leasingskuld","Amortisation leasing"]
["Bokslutsdispositioner","Appropriations"]
["TILLGÅNGAR","Assets"]
["Tillgångar per segment","Assets per segment"]
["Hänförligt till moderföretagets aktieägare","Attributable to parent company´s shareholders"]
["Nedskrivning för föväntade kreditförluster","Bad debts loss"]
["Upptagna lån","Borrowings"]
["Varumärke","Brand"]
["Balanserade utgifter för utvecklingsarbeten och liknande arbeten","Capitalised expenses for development work and equivalent work"]
["Kassa och bank ","Cash and cash equivalents"]
["Likvida medel","Cash and cash equivalents"]
["Likvida medel ","Cash and cash equivalents"]
["Likvida medel vid periodens början","Cash and cash equivalents at the beginning of the period"]
["Likvida medel vid periodens slut","Cash and cash equivalents at the end of the period"]
["Kassaflöde","Cash flow"]
["Periodens kassaflöde","Cash flow for (-used in) the period"]
["Kassaflöde från investeringsverksamheten","Cash flow from (-used in) investing activities"]
["Kassaflöde från finansieringsverksamheten","Cash flow from financing activities"]
["Kassaflöde från löpande verksamhet","Cash flow from operating activities"]
["Kassaflöde från den löpande verksamheten före förändringar av rörelsekapital","Cash flow from operations"]
["Kassaflödespåverkan av förvärvet","Cash flow impact of the acquisition"]
["Centrala omkostnader ","Central overhead costs"]
["Ökning (-)/Minskning (+) av varulager","Change in inventories"]
["Ökning (+)/Minskning (-) av rörelseskulder","Change in other operating liabilities"]
["Ökning (-)/Minskning (+) av rörelsefordringar","Change in trade recievables"]
["Skuld på balansdagen","Closing balance liabilities"]
["Utgående eget kapital ","Closing equity"]
["Periodens totalresultat","Comprehensive income for the period"]
["Periodens totalresultat, efter skatt ","Comprehensive income for the period, after tax"]
["Koncessioner, patent, licenser, varumärken samt liknande rättigheter","Concessions, patents, licenses, trademarks and similar rights"]
["Konsoliderat","Consolidated"]
["Avtalstillgångar","Contract assets"]
["Avtalsskulder","Contract liabilities"]
["Omsättningstillgångar","Current assets"]
["Kortfristiga skulder","Current liabilities"]
["Kortfristiga skulder till kreditinstitut ","Current liabilities to credit institutions"]
["Kortfristiga fordringar","Current receivables"]
["Aktuell skatteskuld","Current tax liability"]
["Skulder per segment","Debt per segment"]
["Uppskjuten skattefordran ","Deferred tax asset"]
["Uppskjuten skatteskuld","Deferred tax asset"]
["Uppskjutna skatteskulder","Deferred tax liabilities"]
["Uppskjutna skattefordringar","Deferred tax receivables"]
["Danmark","Denmark"]
["Av- och nedskrivningar ","Depreciation and amortization"]
["Avskrivningar och nedskrivningar","Depreciation and amortization"]
["Avskrivningar och nedskrivningar av materiella och immateriella tillgångar","Depreciation and amortization of tangible and intangible fixed assets"]
["Avyttring av materiella anläggningstillgångar","Divestments of tangible assets"]
["Utdelning","Dividends to shareholders"]
["Resultat per aktie","Earnings per share"]
["Resultat per aktie efter utspädning (SEK)","Earnings per share after dilution, SEK"]
["Resultat per aktie före utspädning (SEK)","Earnings per share before dilution, SEK"]
["Rörelseresultat ","EBIT"]
["EBITDA","EBITDA"]
["Resultat efter finansiella poster ","EBT"]
["Personalkostnader","Employee benefits expense"]
["Inventarier, verktyg och installationer","Equipment, tools and installations"]
["Eget kapital","Equity"]
["Eget kapital och skulder","Equity and liabilities"]
["Eget kapital per stamaktie (kr)","Equity per share (kr)"]
["Kursdifferens i likvida medel","Exchange difference in cash and cash equivalents"]
["Extern försäljning","External sales"]
["Verkligt värde","Fair value"]
["Finansiella anläggningstillgångar","Financial assets"]
["Finansiella tillgångar","Financial assets"]
["Finansiella tillgångar värderade till verkligt värde via resultatet ","Financial assets reported at fair value via income statement"]
["Finansiella tillgångar värderade till upplupet anskaffningsvärde ","Financial assets reported at net historical acquisition cost"]
["Finansiella kostnader","Financial expenses"]
["Finansiella intäkter","Financial income"]
["Resultat från finansiella poster ","Financial income and expenses"]
["Finansiella skulder","Financial liabilities"]
["Finansiella skulder värderade till verkligt värde via resultatet","Financial liabilities reported at fair value via income statement"]
["Finansiella skulder värderade till upplupet anskaffningsvärde","Financial liabilities reported at net historical acqusition cost"]
["Finansieringsverksamheten","Financing activities"]
["Anläggningstillgångar","Fixed assets"]
["Fast pris","Fixed Price"]
["Valutaterminer","Foreign exchange forwards"]
["Geografisk marknad","Geographic market"]
["Handelsvaror ","Goods for resale"]
["Goodwill","Goodwill"]
["Goodwill som uppstår vid förvärvet ","Goodwill som uppstår vid förvärvet "]
["Koncernen","Group"]
["Erhållna koncernbidrag","Group contribution received"]
["Summa koncernen","Group total"]
["Resultat efter finansiella poster","Income after financial items"]
["Skatt","Income tax"]
["Skatt ","Income tax"]
["Nedlagda utgifter på annans fastighet","Incurred expenses on other property"]
["Immateriella anläggningstillgångar","Intangible fixed assets"]
["Räntekostnader och liknande kostnader","Interest expenses and similar costs"]
["Räntekostnader och liknande resultatposter","Interest expenses and similar profit/loss items"]
["Ränteintäkter och liknande resultatposter","Interest income and similar profit/loss items"]
["Varulager","Inventories"]
["Investeringsverksamheten","Investing activities"]
["Investeringar","Investments"]
["Andelar i koncernföretag","Investments in group companies"]
["Jämförelsestörande poster","Items affecting comparability"]
["TSEK","KSEK"]
["Leasingskulder","Lease liabilities"]
["Skulder","Liabilities"]
["Skulder till kreditinstitut","Liabilities to credit institutions"]
["Skulder till kreditinstitut ","Liabilities to credit institutions"]
["Skulder till koncernföretag","Liabilities to Group companies"]
["LTM","LTM"]
["Maskiner och andra tekniska anläggningar","Machinery and other technical facilities"]
["MSEK","MSEK"]
["Redovisat värde","Net carrying amount"]
["Netto av kassaflöde från förvärvet","Net cash flow from the acquisition"]
["Periodens resultat","Net profit (-loss) for the period"]
["Årets resultat ","Net profit for the year"]
["Periodens resultat ","Net Profit/Loss for the period"]
["Nettoomsättning","Net sales"]
["Nettoomsättning","Net sales"]
["Nyemission","New issue"]
["Långfristiga skulder","Non-current liabilities"]
["Långfristiga skulder till kreditinstitut ","Non-current liabilities to credit institutions"]
["Fritt eget kapital","Non-restricted equity"]
["Norge","Norway"]
["Not","Note"]
["Ingående eget kapital ","Opening equity"]
["Den löpande verksamheten","Operating activities "]
["Rörelsens kostnader","Operating costs"]
["Rörelsens intäkter","Operating income"]
["Rörelseresultat","Operating income"]
["Rörelsemarginal","Operating margin"]
["Rörelseresultat (EBIT)","Operating profit (EBIT)"]
["Rörelseresultat","Operating profit (-loss)"]
["Rörelseresultat före av- och nedskrivningar (EBITDA)","Operating profit before depreciation and amortization (EBITDA)"]
["[Övrigt, specificera vad]","Other"]
["Övrigt","Other"]
["Periodens övrigt totalresultat","Other comprehensive income"]
["Övrigt totalresultat","Other comprehensive income"]
["Övrigt totalresultat för perioden, efter skatt","Other comprehensive income for the period, after tax"]
["Övrigt tillskjutet kapital","Other contributed capital "]
["Övriga kortfristiga skulder","Other current liabilities"]
["Övriga kortfristiga fordringar","Other current receivables"]
["Övriga externa kostnader","Other external expenses"]
["Övriga finansiella tillgångar","Other financial assets"]
["Övriga finansiella skulder","Other financial liabilities"]
["Övriga skulder","Other liabilities"]
["Övriga ej kassaflödespåverkande poster ","Other non-cash items"]
["Övriga rörelsekostnader","Other operating expenses"]
["Övriga rörelseintäkter","Other operating revenue"]
["Övriga intäkter","Other revenue"]
["Betald inkomstskatt","Paid tax"]
["Förutbetalda kostnader och upplupna intäkter","Prepaid expenses and accrued income"]
["Förutbetalda intäkter och upplupna kostnader","Prepaid income and accrued expenses"]
["Vara/tjänst A","Product/service A"]
["Vara/tjänst B","Product/service B"]
["Vara/tjänst C","Product/service C"]
["Resultat före skatt ","Profit (-loss) before tax"]
["Resultat per stamaktie (kr)","Profit per share (kr)"]
["Resultat före skatt","Profit/loss before tax"]
["Materiella anläggningstillgångar","Property plant and equipment"]
["Inköp av varor/ tjänster","Purchase of goods/services"]
["Förvärv av immateriella anläggningstillgångar","Purchase of intangible assets"]
["Köpeskilling (likvida medel) ","Purchase price (cash and cash equivalents)"]
["Fordringar hos koncernföretag","Receivables from Group companies"]
["Avstämning av tillgångar","Reconciliation of assets"]
["Avstämning av skulder","Reconciliation of liabilities"]
["Avstämning av resultat ","Reconciliation of results"]
["Återbetalningsskulder","Repayment liabilities"]
["Amortering av låneskulder","Repayment of debts"]
["Reserver","Reserves"]
["Reserver ","Reserves"]
["Bundet eget kapital","Restricted equtiy"]
["Balanserad vinst eller förlust ","Retained earnings"]
["Balanserade vinstmedel ","Retained earnings"]
["Balanserat resultat ","Retained earnings"]
["Returrättstillgångar","Return rights assets"]
["Intäkter/(Kostnader)","Revenue/(Costs)"]
["Nyttjanderättstillgångar","Right of use asset"]
["Försäljning av varor/ tjänster","Sale of goods/services"]
["Intäkter","Sales"]
["Försäljning mellan segmenten","Sales between segments"]
["Summa segment","Segment total"]
["Aktiekapital","Share capital "]
["Inbetalning aktiekapital","Share capital increases"]
["Överkursfond","Share premium reserve"]
["Erhållna aktieägartillskott","Shareholders’ contributions received"]
["Soliditet (%)","Solidity (%)"]
["Sverige","Sweden"]
["Sverige","Sweden"]
["Skatteskulder","Tax liabilities"]
["Skattefordringar","Tax receivables"]
["Summa ","Total"]
["Summa bokslutsdispositioner","Total appropriations"]
["SUMMA TILLGÅNGAR","Total assets"]
["Totala tillgångar","Total assets"]
["Summa kassa och bank ","Total cash and cash equivalents"]
["Summa omsättningstillgångar","Total current assets "]
["Summa kortfristiga skulder","Total current liabilities"]
["Summa kortfristiga fordringar","Total current receivables"]
["Summa eget kapital","Total equity"]
["Totalt eget kapital","Total equity"]
["Summa eget kapital och skulder","Total equity and liabilities"]
["Summa finansiella  anläggningstillgångar","Total financial assets"]
["Totala skulder","Total liabilities"]
["Summa anläggningstillgångar","Total non-current assets"]
["Summa långfristiga skulder","Total non-current liabilities"]
["Köpeskilling","Total purchase consideration"]
["Totala intäkter ","Total revenue"]
["Leverantörsskulder","Trade payables"]
["Transaktioner med koncernens ägare","Transactions with owners"]
["Typ av kund","Type of client"]
["Typ av avtal","Type of contract"]
["Typ av vara eller tjänst","Type of product or service"]
["Teckningsoptioner","Warrants"]
["[Typ av närstående 1]","[Type of related party 1]"]
["[Typ av närstående 2]","[Type of related party 2]"]
["Fordran på balansdagen","Receivable on the balance sheet date"]
["Förskott till leverantörer","Advances to suppliers"]
["Förvärvade likvida medel","Acquired cash and cash equivalents"]
["Kostnader för underhållsstopp","Costs for maintenance stoppages"]
["Löpande räkning","Current account"]
["Netto av totala identifierbara tillgångar värderade till verkligt värde","Net of total identifiable assets valued at fair value"]
["Nettovinst vid försäljning av verksamheter & materiella anläggningstillgångar","Net profit on sale of operations & tangible fixed assets"]
["Offentliga kunder","Public customers"]
["Poster som har omförts eller kan omföras till resultatet (efter skatt) ","Items that have been transferred or can be transferred to the result (after tax)"]
["Poster som inte kan omföras till resultatet (efter skatt) ","Items that cannot be transferred to profit or loss (after tax)"]
["Privata kunder","Private customers"]
["Segmentsresultat ","Segment result"]
["Totala intäkter från avtal med kunder","Total revenue from contracts with customers"]
["Valutakursdifferens vid omräkning av dotterföretag i utlandet","Exchange rate difference when translating subsidiaries abroad"]
["Valutasäkring m.m.","Currency hedging, etc."]
["Övriga upplysningar","Other information"]
["R12","LTM"]

{"sheet":"Income statement - 6Q ","index":2,"n_rows":27,"n_cols":7,"rows_kept":27,"cut":false,"hidden":false,"merged":[]}
["Storskogen Group AB"]
[]
["Consolidated Income Statement, Group"]
[{"$f":"ActQ_Year","v":"Q1 2026"}]
[]
["SEK m",{"$f":"ActQ_Year","v":"Q1 2026"},{"$f":"m1Q_Q_Year","v":"Q4 2025"},{"$f":"m2Q_Q_Year","v":"Q3 2025"},{"$f":"m3Q_Q_Year","v":"Q2 2025"},{"$f":"m4Q_Q_Year","v":"Q1 2025"},{"$f":"m5Q_Q_Year","v":"Q4 2024"}]
["Net sales",7850.6631983933012,8723.0701356458012,7981.5310747240001,8452.0456289312024,7940.3509770985002,8590.7410444791967]
["Raw materials and supplies",-4263.3555461124997,-4643.7229155778987,-4415.3170802958002,-4517.8153965677002,-4168.7697914065993,-4571.6492610770019]
["Other external expenses",-893.87257786930013,-1046.9348654761,-877.1613178716002,-926.9122023683999,-955.93068636949977,-1032.5105001590002]
["Personnel costs",-1922.6561311811004,-2061.9629222531998,-1739.0278883297997,-1980.3394095835999,-1944.0978954339,-1983.1015894528007]
["Other operating income and expense",50.895848003700024,99.508353116299958,85.548332732999981,66.304824396000015,70.586656167699985,128.04693331149997]
["EBITDA",821.6747912340976,1069.9577854549011,1035.5731209597971,1093.2834448075021,942.13926005619999,1131.5266271018941]
["Depreciation and impairment of tangible assets",-248.0733876063,-264.00774395270003,-266.55826037190002,-259.88739401650008,-262.58470621650002,-259.43772257669991]
["EBITA",573.60140362779703,805.95004150220132,769.01486058789715,833.3960507910017,679.55455383970002,872.08890452519415]
["Amortisation and impairment of intangible assets",-167.78998268999996,-176.16870487349991,-171.74908195310005,-172.47256652319999,-176.4688341113,-194.07604267310001]
["Operating profit (EBIT)",405.81142093779658,629.78133662869993,597.26577863479588,660.92348426780256,503.08571972839991,678.01286185209415]
["Net financial items",-156.05789377080001,-173.18963832620011,-137.76227837369998,-296.58336012989986,-198.26995294299999,-203.90957296239984]
["Profit before tax",249.75352716699845,456.57632618759936,459.51888114039758,364.34012413790163,304.81576678540046,474.10328888969434]
["Income tax ",-79.179800990499999,-81.412849938600004,-111.85088799419999,-104.01542071279999,-89.085886240299999,-86.540557689600021]
["Profit for the period",170.57372617649844,375.16347624899936,347.6679931461976,260.32470342510163,215.72988054510046,387.56273120009433]
[""]
["Profit for the period attributable to:"]
["Owners of the parent company",145.87949987899941,328.21666902039965,316.05108617279694,224.12205928540183,194.48923240380051,327.42022421239403]
["Non-controlling interests",24.694226297499998,46.946807228600001,31.616906973400013,36.202644139699999,21.240648141299999,60.142476410499995]
[""]
["Basic earnings per share, SEK",0.09,0.19489999999999999,0.18737556219154833,0.13289999999999999,0.115,0.2]
["Diluted earnings per share, SEK",0.09,0.19489999999999999,0.18737533405726459,0.13289999999999999,0.115,0.2]

{"sheet":"Balance sheet - 6Q","index":3,"n_rows":38,"n_cols":7,"rows_kept":38,"cut":false,"hidden":false,"merged":[]}
[{"$f":"'Income statement - 6Q '!A1","v":"Storskogen Group AB"}]
[]
["Consolidated balance sheet, Group"]
[{"$f":"'Income statement - 6Q '!A4","v":"Q1 2026"}]
[]
["SEK m",{"$f":"ActQ_Year","v":"Q1 2026"},{"$f":"m1Q_Q_Year","v":"Q4 2025"},{"$f":"m2Q_Q_Year","v":"Q3 2025"},{"$f":"m3Q_Q_Year","v":"Q2 2025"},{"$f":"m4Q_Q_Year","v":"Q1 2025"},{"$f":"m5Q_Q_Year","v":"Q4 2024"}]
["Assets"]
["Goodwill",18267.822543440201,18123.844560747701,18258.742273789205,18214.033851575303,18055.444308444603,18454.735992608199]
["Other intangible assets",4750.3053005854999,4885.8583716303001,5035.9666847917069,5097.5249633294989,5148.0426582940017,5482.7526374613008]
["Property, plant and equipment ",3615.0864700555976,3564.8691147267018,3616.7124956800994,3645.7694480215996,3680.8174366483981,3780.9242839742988]
["Right-of-use assets",1508.6084738506997,1540.2614380486004,1607.0095148124994,1601.9713041468001,1638.9083837283995,1591.0359264937999]
["Financial non-current assets ",334.25097134744897,277.37348212979236,248.18666724868973,295.34601394808988,300.37745816540018,306.77078582930159]
["Pension obligation assets",17.7813692607,17.576912298,11.621270128400001,11.9216305087,11.543335560299999,12.5395805]
["Deferred tax assets",159.56374473219998,162.09676333130002,147.8962358487,154.64372741290001,153.16155877689999,168.7014062625]
["Total non-current assets ",28653.418873272349,28571.880642912394,28926.135142299103,29021.21093894279,28988.295139618105,29797.4606131295]
["Inventories",4596.1239315458997,4381.8454875531997,4518.4777126656991,4466.4151634689006,4386.2455487231,4345.9273861018]
["Trade receivables",4279.3288523877,4139.8870457505,4303.5848707774994,4272.4432178551997,4194.2692987913997,4062.8442431301]
["Current receivables ",3319.0061093943987,3029.9286674613013,3424.1443265913995,3430.6881032924011,3098.7063359461017,3074.5326724727001]
["Current investments",1.3708903336,0.31496684030000005,6.8989676585000002,8.1031548499999995E-2,4.0634998300000003E-2,4.3427526500000001E-2]
["Cash and cash equivalents",1184.1425351063001,1331.5856656776996,1138.6818776458999,1149.6484016050999,1077.9570019795001,1899.4702254820004]
["Total current assets ",13379.972318767899,12883.561833283002,13391.787755338999,13319.275917770101,12757.218820438404,13382.8179547131]
["Total assets ",42033.391192040246,41455.4424761954,42317.922897638098,42340.486856712887,41745.513960056509,43180.278567842601]
[""]
["Equity and liabilities"]
["Total equity ",20937.395709563691,20599.110994897022,20565.895412226488,20454.609489598504,20273.245647417607,20806.755432925202]
["Interest-bearing non-current liabilities",8916.8384877289009,8925.3826655328994,8512.8338649986999,8544.5986169819989,7941.1746542859019,8575.1127621359992]
["Non-current lease liabilities",1079.2085263795998,1102.3319981431005,1151.9445163935,1140.0290736732002,1163.0211875311998,1114.4143440979003]
["Provisions for pensions",221.25837405999999,221.18691709729998,240.09889393949999,257.14646795420003,239.05831213720001,263.3458289038]
["Non-interest-bearing non-current liabilities",449.93904794219998,380.23935790340005,332.07920671750003,1156.407654889,1096.2472165171,1166.9329814577]
["Provisions ",84.861645603099817,74.07275076830004,76.115843612999868,66.460603528799993,69.370986288099743,81.052354981300027]
["Deferred tax liabilities",1493.4713282882001,1504.496804031,1566.7306617604002,1575.1667416422999,1577.5035434472002,1662.5446596972999]
["Total non-current liabilities",12245.577410002001,12207.710493476001,11879.802987422599,12739.809158669501,12086.375900206702,12863.402931274]
["Interest-bearing current liabilities",323.53091527219999,367.80189399870005,1180.5411542076999,1183.9757806911002,1399.1216454013997,1422.6284556198]
["Current lease liabilities",444.34246925219998,448.90825738249998,480.87790654640003,483.04305087600005,494.91440608350001,492.05742313830001]
["Trade payables",2628.2232051955002,2429.9917676186001,2570.0729255964002,2519.6907878330999,2499.1748954946002,2310.8473759202002]
["Non-interest-bearing current liabilities",5454.3234661715996,5401.9206779098022,5640.7309195712005,4959.3580704618998,4992.6776751157004,5284.5879535423983]
["Total current liabilities  ",8850.4200558914999,8648.6225969096013,9872.2229059217007,9146.0676898621005,9385.8886220952008,9510.1212082206985]
["Total equity and liabilities ",42033.393175457197,41455.444085282623,42317.921305570788,42340.486338130111,41745.510169719506,43180.279572419902]

{"sheet":"Cash flow statement - 6Q","index":4,"n_rows":27,"n_cols":7,"rows_kept":27,"cut":false,"hidden":false,"merged":[]}
[{"$f":"'Income statement - 6Q '!A1","v":"Storskogen Group AB"}]
[]
["Consolidated cash flow statement, Group "]
[{"$f":"'Income statement - 6Q '!A4","v":"Q1 2026"}]
[]
["SEK m",{"$f":"ActQ_Year","v":"Q1 2026"},{"$f":"m1Q_Q_Year","v":"Q4 2025"},{"$f":"m2Q_Q_Year","v":"Q3 2025"},{"$f":"m3Q_Q_Year","v":"Q2 2025"},{"$f":"m4Q_Q_Year","v":"Q1 2025"},{"$f":"m5Q_Q_Year","v":"Q4 2024"}]
["Profit before tax",249.75352716700095,456.59169830249931,459.50350026109987,364.34012413790163,304.81576678540046,474.1032888921988]
["Adjustment for non-cash items",440.68178624299998,413.46690359230178,403.56770087528434,577.63800008459975,414.37363768720002,515.93594492149987]
["Income tax paid ",-254.42313469549995,49.028665584399988,-115.57445181769997,-154.95592518399999,-170.3205694239,68.971805071199924]
["Change in working capital ",-247.6582241509,232.40575640970005,-88.342781798699988,-259.54314704189994,-435.92132540440025,621.30349498759995]
["Cash flow from operating activities",188.35395456359907,1151.4930238889017,659.15396752000152,527.47905199660147,112.94750964429886,1680.3145338724976]
["Net investments in non-current assets",-124.88308587399999,-137.31213131559991,-74.544888352197802,-109.96293023440043,-153.01276351429993,-228.81211017969986]
["Business combinations and divestments",-22.578608250000023,-173.25699362500131,-399.86343464779787,-181.65116269149971,-3.8376904758999855,-107.93176425940003]
["Cash flow from investing activities",-147.46169412400002,-310.56912494060123,-474.40832299999568,-291.61409292590014,-156.85045399019992,-336.7438744390999]
["Treasury shares (repurchased own shares)",-9.2631334315,-90.729799999999997,0,0,0,0]
["Dividend to owners of the parent company",0,0,0,-168.67212943239997,0,0]
["Dividends to minority owners",-21.159879962200002,-7.4779979079000043,-5.3636292894000093,-67.1031213407,-9.6313926575999993,-6.0835524594000105]
["Proceeds from borrowings",29.897045197200004,149,69.8,3438.1,22.8,981]
["Repayment of borrowings",-99.151145,-478,-68.39,-3274.8,-492.5,-1578]
["Settlement of derivatives related to financing",17.433807210000005,-62,-46.2,30.1,-115.8,0]
["Repayment of lease liability",-121.9272914262,-151.20430096060005,-134.79404176709997,-132.15222146020002,-137.20336174490001,-141.80058517140003]
["Other financing activities",5.0040615016513357E-3,-7.9399737600908793E-2,-0.04,7.3559999999999999,-0.8,0.2334530652030935]
["Cash flow from financing activities",-204.16559335119831,-639.84677850210244,-184.98888774361171,-167.18886265820029,-733.09903353120103,-744.68931944939698]
["Cash flow for the period",-163.27833695800064,201.06211236460075,9.9986140894570141E-8,68.65580056510035,-776.98163742899942,598.89759432789845]
["Cash and cash equivalents at beginning of period",1331.5856656776996,1138.6818776458999,1149.6484016051002,1077.9570019795001,1899.4702254813003,1277.9299622768001]
["Exchange rate differences in cash and cash equivalents",15.8302023396,-8.1733324144000008,-10.7232807356,3.0153032130999975,-44.511245624899999,22.658923221199998]
["Cash and cash equivalents at end of period",1184.1375310592989,1331.5706575961008,1138.6822118453047,1149.6281057577005,1077.9773424274008,1899.4864798258986]

{"sheet":"Net sales by vertical - 6Q  New","index":5,"n_rows":21,"n_cols":7,"rows_kept":21,"cut":false,"hidden":false,"merged":[]}
[{"$f":"'Income statement - 6Q '!A1","v":"Storskogen Group AB"}]
[]
["Net sales by vertical"]
[{"$f":"'Income statement - 6Q '!A4","v":"Q1 2026"}]
[]
["SEK m",{"$f":"ActQ_Year","v":"Q1 2026"},{"$f":"m1Q_Q_Year","v":"Q4 2025"},{"$f":"m2Q_Q_Year","v":"Q3 2025"},{"$f":"m3Q_Q_Year","v":"Q2 2025"},{"$f":"m4Q_Q_Year","v":"Q1 2025"},{"$f":"m5Q_Q_Year","v":"Q4 2024"}]
["Business Services",989.79187326260001,1032.0445880758998,965.44237188739964,964.92588860499984,959.55409259680005,1006.0642722798005]
["Infrastructure Services",1161.5269064651002,1493.1334069188006,1250.4492525603005,1421.6054932204995,1180.4663920669998,1583.5689027223996]
["Elimineringar inom affärsområde",-4.3152678199999999,-11.400293930000004,-5.8288581199999996,-12.151754070000001,-5.85539422,-8.2369616400000005]
["Summa segment Services",2147.0035119077002,2513.7777010647005,2210.0627663277,2374.3796277554993,2134.1650904437997,2581.3962133622017]
["Consumer Products",1374.5973459413001,1775.5167108550004,1612.7248975773991,1558.2011914470995,1461.8356662087001,1617.4239704928]
["Professional Products",785.51159209420007,897.50817554839989,721.97464345089998,793.41180464889987,780.65327235649988,871.25842081740007]
["Elimineringar inom affärsområde",-1.8916729113999999,-5.446444513100003,-3.4109473594999988,-2.6140602175000005,-2.5667181163000001,-4.928881153199999]
["Summa segment Trade",2158.2172651241003,2667.5784418903004,2331.288593668799,2348.9989358784992,2239.9222204489001,2483.7535101570002]
["Automation",1065.6468059606,1181.5375604482001,1129.5013749414998,1206.9072988723001,1192.2611904614,1163.5113918587001]
["Industrial Technologies",1456.2348598193005,1334.186452913,1324.9460006825,1396.1630531995995,1303.6861971259,1307.7858913794]
["Product Solutions",1040.3099105215997,1044.1001462919005,999.63707271910005,1144.3407688942009,1090.9833016894995,1082.9705589062994]
["Elimineringar inom affärsområde",-5.5058600000000002,-8.6289937399999985,-4.0718369999999986,-9.2235597000000045,-7.7051185999999996,-8.4183074900000037]
["Summa segment Industry",3556.6857163015002,3551.1951659131005,3450.0126113430997,3738.1875612661006,3579.2255706767996,3545.8495346544]
["Koncernmässiga elimineringar",-11.24329494,-9.4811732223000043,-9.8328966155999975,-9.5204959689000024,-12.961904471,-20.258213694399998]
["Totalt",7850.6631983933003,8723.0701356458012,7981.5310747239992,8452.0456289311987,7940.3509770985002,8590.7410444792004]

{"sheet":"Quarterly data - 6Q","index":6,"n_rows":39,"n_cols":7,"rows_kept":39,"cut":false,"hidden":false,"merged":[]}
[{"$f":"'Income statement - 6Q '!A1","v":"Storskogen Group AB"}]
[]
["Quarterly data, Group"]
[{"$f":"'Income statement - 6Q '!A4","v":"Q1 2026"}]
[]
["SEK m",{"$f":"ActQ_Year","v":"Q1 2026"},{"$f":"m1Q_Q_Year","v":"Q4 2025"},{"$f":"m2Q_Q_Year","v":"Q3 2025"},{"$f":"m3Q_Q_Year","v":"Q2 2025"},{"$f":"m4Q_Q_Year","v":"Q1 2025"},{"$f":"m5Q_Q_Year","v":"Q4 2024"}]
["Net Sales"]
["Services",2147.0035119077002,2513.7777010647001,2210.0627663277,2374.3796277555002,2134.1650904438002,2581.3962133621994]
["Trade",2158.2172651241003,2667.5784418903004,2331.2885936687999,2348.998935878501,2239.9222204489001,2483.7535101570002]
["Industry",3556.6857163015002,3551.1951659131009,3450.0126113430997,3738.1875612661006,3579.2255706768001,3545.8495346544005]
["Group operations",-11.24329494,-9.4811732223000043,-9.8328966155999975,-9.5204959689000024,-12.961904471,-20.258213694299997]
["Group total",7850.6631983933012,8723.0701356458012,7981.5310747240001,8452.0456289312024,7940.3509770985002,8590.7410444792986]
["","","","","","",""]
["Adjusted EBITA","","","","","",""]
["Services",165.6139748172003,269.74219825190028,239.37458886050021,255.76688161160075,236.15550002159972,340.46415741439955]
["Trade",153.35444276060002,227.71380845090076,210.66645380049957,224.85688401780124,168.1539629593004,183.4229344998993]
["Industry",340.13955437860011,359.70403877210055,328.77622653639889,387.00245211480041,350.25436127409932,372.67350870590099]
["Group operations",-20.405559550700005,-41.395507395900012,-19.707683521199996,-24.859410767699963,-54.8944205297,-47.643679382200013]
["Group total",638.70241240569931,815.7645380790018,759.10958567619718,842.76680697650181,699.66940372530007,848.91692123799623]
["","","","","","",""]
["Adjusted EBITA-margin, %","","","","","",""]
["Services",7.7137263119819277,10.730551000498258,10.831121744938109,10.771945590409949,11.065474788198843,13.189147626855549]
["Trade",7.1056072638628409,8.536349105053425,9.0364811277598704,9.5724557633189011,7.5071340167160301,7.3849089190941895]
["Industry",9.563385171189708,10.129098006913164,9.529710861213502,10.352676150463811,9.7857582417715374,10.510133187087533]
["Group operations",0,0,0,0,0,0]
["Group total",8.1356491326288811,9.3518053322244405,9.5108266643245152,9.9711577998552912,8.8115677221735069,9.881765924995948]
[""]
["Average number of employees"]
["Services",3086,3140.8,3146.99,3183.86,3152,3609.8]
["Trade",1800,2095.88,2096.36,2079.2199999999998,2076,2150.96]
["Industry",4969,4855.1400000000003,4838.75,4868.7,4841,4968.92]
["Group operations",81,81.520000000000437,79.199999999998909,80.180000000000291,80,85.610000000000582]
["Group total",9936,10173.34,10161.299999999999,10211.959999999999,10149,10815.29]
[""]
["Number of business units, end of period"]
["Services",53,53,54,52,52,53]
["Trade",25,26,25,25,25,25]
["Industry",35,35,35,35,36,37]
["Group total",113,114,114,112,113,115]

{"sheet":"APM - 6Q","index":7,"n_rows":40,"n_cols":7,"rows_kept":40,"cut":false,"hidden":false,"merged":[]}
[{"$f":"'Income statement - 6Q '!A1","v":"Storskogen Group AB"}]
[]
["Performance measures"]
[{"$f":"'Income statement - 6Q '!A4","v":"Q1 2026"}]
[]
["SEK m 1)",{"$f":"ActQ_Year","v":"Q1 2026"},{"$f":"m1Q_Q_Year","v":"Q4 2025"},{"$f":"m2Q_Q_Year","v":"Q3 2025"},{"$f":"m3Q_Q_Year","v":"Q2 2025"},{"$f":"m4Q_Q_Year","v":"Q1 2025"},{"$f":"m5Q_Q_Year","v":"Q4 2024"}]
["Net sales",7850.6631983933012,8723.0701356458012,7981.5310747240001,8452.0456289312024,7940.3509770985002,8590.7410444792986]
["Adjusted EBITDA",886.78883801199663,1079.7722820316999,1025.667846048096,1102.6606209930026,962.26052994179997,1108.3610638145969]
["Adjusted EBITA",638.70241240569658,815.76453807899986,759.10958567619593,842.78180697650259,699.68440372529994,848.93192123799702]
["Adjusted EBITA margin, %",8.1356491326288456,9.3518053322244175,9.5108266643244974,9.9713352716847083,8.8117566306996302,9.8819405315860323]
["Operating profit",405.81142093779658,629.78133662869993,597.26577863479588,660.92348426780256,503.08571972839991,678.01286185359697]
["Operating margin, % ",5.1691355326623745,7.2197211169399225,7.4830978297663178,7.819686656748198,6.3358121218998491,7.8923675890488054]
["Profit before tax",249.75352650049891,456.55266817679939,459.50805978699771,364.33813010380157,304.81576726460048,474.10324210469798]
["Profit for the period",170.57372550999702,375.13981823819921,347.65717179279761,260.32270939100158,215.72988102430031,387.56268441749808]
["Working capital",5133.4840672771606,5015.4172398179589,5054.682070922041,5091.5810123685587,5142.0760906888991,5168.650660387103]
["Return on working capital, % (12 months)",59.53740779327881,62.154556348916302,62.327613753197198,62.342934926047036,62.723804231671451,62.472543366362132]
["Return on equity, % (12 months)",5.6098755843370824,5.8368574715928423,5.9243545170549545,5.5140579063466229,0.92638667461282898,0.57011425323192433]
["Return on equity, adjusted % (12 months) ",6.3610314019646372,6.3699506624889626,6.3553042696862212,5.9590212481310978,5.8171412872420429,5.5648205360432534]
["Return on capital employed, % (12 months) ",10.037622819164909,10.23882051573116,10.286930492525816,10.359399448248489,10.426609992736699,10.374063572166117]
["Equity/assets ratio, % ",49.811340736003238,49.689762705405201,48.598546440884832,48.309811738396483,48.563890402249498,48.185783239528462]
["Interest-bearing net debt",9530.3756737373005,9513.4218640062008,10191.7170113542,10185.588380474999,9886.8265342843006,9692.5378978855988]
["Net debt",11219.225545236903,11061.372643600302,11793.634614344799,11956.798504750101,11821.121703463399,11632.5167746191]
["Debt/equity ratio, x",0.53584627720017308,0.53698301088529332,0.57345592681237922,0.58455276356316277,0.58308974838319316,0.55907403785846754]
["Interest-bearing net debt/adjusted RTM EBITDA (12 months), x",2.325198661013482,2.2833197643893706,2.4071506573683479,2.4379100958532791,2.3374958056461907,2.2765208410083591]
["Interest coverage ratio, x",2.9084601331499678,3.9334116764109988,3.8895817874121787,2.5859117650330576,2.7964210685692654,3.1719749636348356]
["Average number of employees",9936,10173.011100000002,10161,10212,10149,10815]
["Number of employees at end of period",10407,10501,10920,10726,10792,10807]
["Cash flow from operating activities",188.35395456360212,1151.4930238889006,659.15396751999447,527.47905199660147,112.94750964429886,1680.3145338724985]
["Adjusted cash conversion, last 12 months, % ",{"$f":"'APM - calculations - 6Q'!B119","v":78.953187013846588},73.772027702684397,82.30110970547247,80.297446753311917,87.528467778072724,94.331883346020106]
["Adjusted cash conversion, Quarterly data, % ",60.168740428730835,105.70901819520778,80.448497514526125,66.468906855262915,39.187509326492574,137.19938460921608]
["Basic earnings per share, SEK",0.09,0.19489999999999999,0.18737556219154833,0.13289999999999999,0.115,0.1973]
["Diluted earnings per share, SEK",0.09,0.19489999999999999,0.18737533405726459,0.13289999999999999,0.115,0.1973]
["Adjusted diluted earnings per share, SEK",0.12574046267901659,0.20073732799610725,0.18150285241046132,0.1859181895297142,0.12717605184375272,0.18722621366184697]
[]
["Items affecting comparability, EBITA",-65.10100877790002,-9.8144965767999928,9.9052749116999976,-9.3707561855000012,-20.114849885599998,23.171983288699987]
["Items affecting comparability, profit for the period",-65.10100877790002,-9.8144965767999928,9.9052749517000152,-89.472861525500008,-20.114849885599998,11.571983288699988]
[]
["1)  Unless otherwise stated"]
[]
["= Figures are based on the last 12 months, not on quarterly data"]

{"sheet":"APM - calculations - 6Q","index":8,"n_rows":229,"n_cols":7,"rows_kept":229,"cut":false,"hidden":false,"merged":[[122,1,122,6],[131,1,131,6],[140,1,140,6],[150,1,150,6],[205,1,205,6],[222,1,222,6],[158,1,158,6],[166,1,166,6],[176,1,176,6],[187,1,187,6],[197,1,197,6]]}
[{"$f":"'Income statement - 6Q '!A1","v":"Storskogen Group AB"}]
[]
["Performance measures including calculations"]
[{"$f":"'Income statement - 6Q '!A4","v":"Q1 2026"}]
[]
["Return on equity"]
[null,"12 months until","12 months until","12 months until","12 months until","12 months until","12 months until"]
["SEK m",{"$f":"ActQ_Year","v":"Q1 2026"},{"$f":"m1Q_Q_Year","v":"Q4 2025"},{"$f":"m2Q_Q_Year","v":"Q3 2025"},{"$f":"m3Q_Q_Year","v":"Q2 2025"},{"$f":"m4Q_Q_Year","v":"Q1 2025"},{"$f":"m5Q_Q_Year","v":"Q4 2024"}]
["Profit for the period",1153.7298989971939,1198.8860533643249,1211.2724466237992,1119.5479018232002,188.61578198739832,116.26369299569586]
["Equity (Average of last 12 months)",20566.051450738603,20539.923395408117,20445.644215531058,20303.520942981253,20360.372958325181,20393.051451810112]
["Return on equity, %",5.6098755843371153,5.8368574715928423,5.9243545170549545,5.5140579063466229,0.92638667461282898,0.57011425323195641]
[]
[]
["Return on equity, adjusted (new 2025)"]
[null,"12 months until","12 months until","12 months until","12 months until","12 months until","12 months until"]
["SEK m",{"$f":"ActQ_Year","v":"Q1 2026"},{"$f":"m1Q_Q_Year","v":"Q4 2025"},{"$f":"m2Q_Q_Year","v":"Q3 2025"},{"$f":"m3Q_Q_Year","v":"Q2 2025"},{"$f":"m4Q_Q_Year","v":"Q1 2025"},{"$f":"m5Q_Q_Year","v":"Q4 2024"}]
["Profit for the period",1153.7298989971939,1198.8860533643249,1211.2724466237992,1119.5479018232002,188.61578198739832,116.26369299569586]
["Reversal of items affecting comparability, profit for the period",154.48309192849999,109.49693303619999,88.110453170700012,90.343225287800024,995.77587960779999,1018.5730221205001]
["Profit for the period, adjusted",1308.2129909256939,1308.3829864005249,1299.3828997944993,1209.8911271110003,1184.3916615951982,1134.836715116196]
["Equity (Average of last 12 months)",20566.051450738603,20539.923395408117,20445.644215531058,20303.520942981253,20360.372958325181,20393.051451810112]
["Return on equity, adjusted, %",6.3610314019646745,6.3699506624889626,6.3553042696862212,5.9590212481310978,5.8171412872420429,5.5648205360432534]
[]
[]
["Return on working capital"]
[null,"12 months until","12 months until","12 months until","12 months until","12 months until","12 months until"]
["SEK m",{"$f":"ActQ_Year","v":"Q1 2026"},{"$f":"m1Q_Q_Year","v":"Q4 2025"},{"$f":"m2Q_Q_Year","v":"Q3 2025"},{"$f":"m3Q_Q_Year","v":"Q2 2025"},{"$f":"m4Q_Q_Year","v":"Q1 2025"},{"$f":"m5Q_Q_Year","v":"Q4 2024"}]
["Adjusted EBITA",3056.343343137798,3117.3103344559158,3150.462717616399,3174.2410372478971,3225.3057405672898,3228.9875252660968]
["Working capital (Average of last 12 months)",5133.4840672771606,5015.4172398179589,5054.682070922041,5091.5810123685587,5142.0760906888991,5168.650660387103]
["Return on working capital, %",59.53740779327881,62.154556348916302,62.327613753197198,62.342934926047036,62.723804231671451,62.472543366362153]
[]
[]
["Return on capital employed (new definition 2025)"]
[null,"12 months until","12 months until","12 months until","12 months until","12 months until","12 months until"]
["SEK m",{"$f":"ActQ_Year","v":"Q1 2026"},{"$f":"m1Q_Q_Year","v":"Q4 2025"},{"$f":"m2Q_Q_Year","v":"Q3 2025"},{"$f":"m3Q_Q_Year","v":"Q2 2025"},{"$f":"m4Q_Q_Year","v":"Q1 2025"},{"$f":"m5Q_Q_Year","v":"Q4 2024"}]
["Adjusted EBITA",3056.3433431377998,3117.3103344559158,3150.4627176163999,3174.2410372478994,3225.3057405672962,3228.9875252660968]
["Capital employed (Average of last 12 months)",30448.876175166726,30445.990626228991,30625.877368428166,30641.168468357329,30933.407337706911,31125.580663777251]
["Return on capital employed, %",10.0376228191649,10.238820515731147,10.286930492525816,10.359399448248489,10.426609992736699,10.374063572166117]
[]
[]
["Interest-bearing net debt"]
[]
["SEK m",{"$f":"ActQ_Year","v":"Q1 2026"},{"$f":"m1Q_Q_Year","v":"Q4 2025"},{"$f":"m2Q_Q_Year","v":"Q3 2025"},{"$f":"m3Q_Q_Year","v":"Q2 2025"},{"$f":"m4Q_Q_Year","v":"Q1 2025"},{"$f":"m5Q_Q_Year","v":"Q4 2024"}]
["Interest-bearing liabilities",9240.3694030011011,9293.1845595316008,9693.3750192063999,9728.5743976730992,9340.2962996873011,9997.7412177557999]
["Lease liabilities",1523.5509956317997,1551.2402555255999,1632.8224229399,1623.0721245492002,1657.9355936146999,1606.4717672362003]
["Pension provisions, net",203.4770047993,203.61000479929999,228.47762381109999,245.22483744550004,227.51497657690001,250.8062484038]
["Financial assets",-252.87920458859998,-202.7123233323,-217.37720929879998,-261.59707356569999,-260.96622614329999,-263.01121002820003]
["Current investments",1.0000000000065512E-5,1.0000000000000001E-5,-6.8989676585000002,9.9999999999961231E-6,2.892528200000001E-3,1.0000000000000286E-4]
["Cash and cash equivalents",-1184.1425351063001,-1331.5856656776996,-1138.6818776458999,-1149.6484016050999,-1077.9570019795001,-1899.4702254820004]
["Interest-bearing net debt",9530.3756737373005,9513,10191.7170113542,10185.625894497,9886.8265342843006,9692.5378978855988]
[]
[]
["Interest-bearing net debt/RTM adjusted EBITDA (12 months)"]
[]
["SEK m",{"$f":"ActQ_Year","v":"Q1 2026"},{"$f":"m1Q_Q_Year","v":"Q4 2025"},{"$f":"m2Q_Q_Year","v":"Q3 2025"},{"$f":"m3Q_Q_Year","v":"Q2 2025"},{"$f":"m4Q_Q_Year","v":"Q1 2025"},{"$f":"m5Q_Q_Year","v":"Q4 2024"}]
["Interest-bearing net debt",9530.3756737373005,9513,10191.7170113542,10185.625894497,9886.8265342843006,9692.5378978855988]
["RTM adjusted EBITDA",4098.7360923317001,4166.4868900000001,4233.9340000000002,4178,4229.6660000000002,4257.6099999999997]
["Interest-bearing net debt/RTM adjusted EBITDA, x",2.325198661013482,2.2833197643893706,2.4071506573683479,2.4379190747958353,2.3374958056461907,2.2765208410083591]
[]
[]
["Net debt"]
[]
["SEK m",{"$f":"ActQ_Year","v":"Q1 2026"},{"$f":"m1Q_Q_Year","v":"Q4 2025"},{"$f":"m2Q_Q_Year","v":"Q3 2025"},{"$f":"m3Q_Q_Year","v":"Q2 2025"},{"$f":"m4Q_Q_Year","v":"Q1 2025"},{"$f":"m5Q_Q_Year","v":"Q4 2024"}]
["Interest-bearing liabilities",9240.3694030011011,9293.1845595316008,9693.3750192063999,9728.5743976730992,9340.2962996873011,9997.7412177557999]
["Lease liabilities",1523.5509956317997,1551.2402555255999,1632.8224229399,1623.0721245492002,1657.9355936146999,1606.4717672362003]
["Pension provisions, net",203.4770047993,203.61000479929999,228.47762381109999,245.22483744550004,227.51497657690001,250.8062484038]
["Contingent consideration liabilities",67.252772903199997,75.098780664100005,55.586604060599996,50.876652871600001,76.4776974456,56.736404999999998]
["Minority options",1622.96799893,1472.85199893,1546.3309989300001,1720.3769989299999,1857.86099926,1883.2859992600002]
["Financial assets",-252.87920458859998,-202.7123233323,-217.37720929879998,-261.59707356569999,-260.96622614329999,-263.01121002820003]
["Current investments",1.0000000000065512E-5,9.9999999999999995E-7,-6.8989676585000002,9.9999999999961231E-6,2.892528200000001E-3,1.0000000000000286E-4]
["Cash and cash equivalents",-1184.1425351063001,-1331.5856656776996,-1138.6818776458999,-1149.6484016050999,-1077.9570019795001,-1899.4702254820004]
["Net debt",11219.225545236903,11061.372643600302,11793.634614344799,11956.798504750101,11821.121703463399,11632.5167746191]
[]
[]
["Working Capital"]
[null,"12 months until","12 months until","12 months until","12 months until","12 months until","12 months until"]
["SEK m",{"$f":"ActQ_Year","v":"Q1 2026"},{"$f":"m1Q_Q_Year","v":"Q4 2025"},{"$f":"m2Q_Q_Year","v":"Q3 2025"},{"$f":"m3Q_Q_Year","v":"Q2 2025"},{"$f":"m4Q_Q_Year","v":"Q1 2025"},{"$f":"m5Q_Q_Year","v":"Q4 2024"}]
["Inventories",4469.8215687913598,4419.7822597024997,4435.5767293652407,4442.6207654279597,4489.6255586522193,4516.8037172323802]
["Trade receivables",4237.9026571124605,4194.6057352608595,4266.8430226772998,4444.6213131032009,4546.2934227328396,4595.5666029306203]
["Other current receivables",2717.6340917704606,2654.3739461076398,2705.8245348720802,2704.8190694178802,2691.3849552074007,2682.5276195545007]
["Trade payables",-2650.55780438176,-2584.0951390597602,-2589.8679724663198,-2633.8573561479197,-2658.9287407595602,-2629.95914511616]
["Other current liabilities",-3641.3164460153598,-3669.2495621932803,-3763.6942435262604,-3866.6227794325605,-3926.2991051439999,-3996.28813421424]
["Working capital (Average of last 12 months)",5133.4840672771606,5015.4172398179589,5054.682070922041,5091.5810123685587,5142.0760906888991,5168.650660387103]
[]
[]
["Debt/equity ratio"]
[]
["SEK m",{"$f":"ActQ_Year","v":"Q1 2026"},{"$f":"m1Q_Q_Year","v":"Q4 2025"},{"$f":"m2Q_Q_Year","v":"Q3 2025"},{"$f":"m3Q_Q_Year","v":"Q2 2025"},{"$f":"m4Q_Q_Year","v":"Q1 2025"},{"$f":"m5Q_Q_Year","v":"Q4 2024"}]
["Net debt",11219.225545236903,11061.372643600302,11793.634614344799,11956.798504750101,11821.121703463399,11632.5167746191]
["Equity",20937.395709563691,20599.110994897299,20565.895412226488,20454.609489598504,20273.245647417607,20806.755432925202]
["Debt/equity ratio, x",0.53584627720018851,0.53698301088529332,0.57345592681237922,0.58455276356316277,0.58308974838319316,0.55907403785846754]
[]
[]
["Equity/assets ratio"]
[]
["SEK m",{"$f":"ActQ_Year","v":"Q1 2026"},{"$f":"m1Q_Q_Year","v":"Q4 2025"},{"$f":"m2Q_Q_Year","v":"Q3 2025"},{"$f":"m3Q_Q_Year","v":"Q2 2025"},{"$f":"m4Q_Q_Year","v":"Q1 2025"},{"$f":"m5Q_Q_Year","v":"Q4 2024"}]
["Equity",20937.395709563691,20599.110994897299,20565.895412226488,20454.609489598504,20273.245647417607,20806.755432925202]
["Total assets",42033.391192040246,41455.442476195502,42317.922897638098,42340.486856712887,41745.513960056509,43180.278567842601]
["Equity/assets ratio, %",49.811340736001689,49.689762705405201,48.598546440884832,48.309811738396483,48.563890402249498,48.185783239528462]
[]
[]
["Capital employed (new definition 2025)"]
[null,"12 months until","12 months until","12 months until","12 months until","12 months until","12 months until"]
["SEK m",{"$f":"ActQ_Year","v":"Q1 2026"},{"$f":"m1Q_Q_Year","v":"Q4 2025"},{"$f":"m2Q_Q_Year","v":"Q3 2025"},{"$f":"m3Q_Q_Year","v":"Q2 2025"},{"$f":"m4Q_Q_Year","v":"Q1 2025"},{"$f":"m5Q_Q_Year","v":"Q4 2024"}]
["Total assets",41978.551476528708,42207.928951688715,42582.575724907329,42979.753774547848,43526.139111543169,44010.777355101876]
["Non-interest-bearing liabilities",-8498.1309318515214,-8546.1236113093019,-8712.1173573676206,-8960.2875428696607,-9119.9561850248392,-9266.7455661164422]
["Provisions",-1853.3999748317201,-1894.8702739580999,-1934.42184298436,-1997.3000258337197,-2040.3185965816399,-2089.54622819412]
["Current investments & Cash and cash equivalents",-1178.1443946787399,-1320.9444401923197,-1310.15915612718,-1380.9977374871403,-1432.4569922297801,-1528.90489701406]
["Capital employed (Average of last 12 months)",30448.876175166726,30445.990626228991,30625.877368428166,30641.168468357329,30933.407337706911,31125.580663777251]
[]
[]
["Adjusted cash conversion, LTM (new definition 2025)"]
[null,"12 months until","12 months until","12 months until","12 months until","12 months until","12 months until"]
["SEK m",{"$f":"ActQ_Year","v":"Q1 2026"},{"$f":"m1Q_Q_Year","v":"Q4 2025"},{"$f":"m2Q_Q_Year","v":"Q3 2025"},{"$f":"m3Q_Q_Year","v":"Q2 2025"},{"$f":"m4Q_Q_Year","v":"Q1 2025"},{"$f":"m5Q_Q_Year","v":"Q4 2024"}]
["Adjusted EBITDA",4094.8831670852087,4170.3484390135136,4199.1808007979962,4210.4885045375941,4278.5589189211969,4303.4929875421922]
["Change in working capital",-363.13839658179995,-551.40149783530001,-162.50375925729975,-216.16129226750007,97.373772329400154,370.06118923590026]
["Cash flow from net investments in non-current assets defined as CapEx",-498.70400559610016,-542.39633545070012,-580.70464394480007,-613.41244728469997,-630.97562653680006,-613.98252384880004]
["Operating cash flow",3233.0407649073086,3076.5506057275138,3455.9723975958964,3380.914764985394,3744.9570647137966,4059.5716529292922]
["Adjusted EBITDA",4094.8831670852087,4170.3484390135136,4199.1808007979962,4210.4885045375941,4278.5589189211969,4303.3929875389867]
["Adjusted cash conversion, %",78.953187013846588,73.772027702684355,82.30110970547247,80.297446753311917,87.528467778072724,94.331883346020106]
[]
[]
["EBITA"]
[null,"Data by quarter"]
["SEK m",{"$f":"ActQ_Year","v":"Q1 2026"},{"$f":"m1Q_Q_Year","v":"Q4 2025"},{"$f":"m2Q_Q_Year","v":"Q3 2025"},{"$f":"m3Q_Q_Year","v":"Q2 2025"},{"$f":"m4Q_Q_Year","v":"Q1 2025"},{"$f":"m5Q_Q_Year","v":"Q4 2024"}]
["Operating profit",405.81142093779658,629.78133662869993,597.26577863479588,660.92348426780256,503.08571972839991,678.01286185469746]
["Amortisation of intangible assets",167.78998281309995,176.16870502919991,171.74908188170005,172.4725679222,176.4688346458,194.0697915113]
["Impairment of intangible assets",-1.2310000000000001E-7,9.9999999999999995E-7,7.140000000000007E-8,1.4998601E-2,1.49994655E-2,2.1251161800000001E-2]
["EBITA",573.60140362779657,805.95004150219984,769.0148605878959,833.39605079100261,679.55455383969991,872.08890452779747]
[]
[]
["EBITDA"]
[null,"Data by quarter"]
["SEK m",{"$f":"ActQ_Year","v":"Q1 2026"},{"$f":"m1Q_Q_Year","v":"Q4 2025"},{"$f":"m2Q_Q_Year","v":"Q3 2025"},{"$f":"m3Q_Q_Year","v":"Q2 2025"},{"$f":"m4Q_Q_Year","v":"Q1 2025"},{"$f":"m5Q_Q_Year","v":"Q4 2024"}]
["Operating profit",405.81142093779658,629.78133662869993,597.26577863479588,660.92348426780256,503.08571972839991,678.01286185469746]
["Amortisations and depreciations",415.87640841940009,440.17644898189997,438.30734225359998,432.3599619387,439.0535408623,453.50751408789995]
["Impairment",-1.30381231E-2,1.0000000000000001E-5,7.140000000000007E-8,6.4186010000000003E-3,6.4194655000000007E-3,1.2671161800000001E-2]
["EBITDA",821.67479123409669,1069.9577854548997,1035.5731209597959,1093.2834448075025,942.13926005619987,1131.5266271043974]
[]
[]
["Net financial items"]
[null,"Data by quarter"]
["SEK m",{"$f":"ActQ_Year","v":"Q1 2026"},{"$f":"m1Q_Q_Year","v":"Q4 2025"},{"$f":"m2Q_Q_Year","v":"Q3 2025"},{"$f":"m3Q_Q_Year","v":"Q2 2025"},{"$f":"m4Q_Q_Year","v":"Q1 2025"},{"$f":"m5Q_Q_Year","v":"Q4 2024"}]
["Interest income",11.4131716638,16.150652257199994,20.124982747800001,11.8429511809,12.922008744599999,-0.9364941081999989]
["Interest expenses  ",-143.45205830610001,-164.21672634970005,-158.72934292850005,-260.16604454409992,-184.52433157250002,-213.45577298299995]
["Financial expenses",-12.645151110400001,-14.210658821200004,-13.1586743714,-11.546846046300001,-11.123913479400001,-9.9256114844999939]
["Exchange rate changes and other",-11.3738566846,-10.95193553820001,14.00531570430001,-36.715414754500017,-15.543716156499981,20.408258826800012]
["Net financial items",-156.05789443730004,-173.22866845190009,-137.75771884780002,-296.58535416399991,-198.2699524638,-203.90961974889993]
[]
[]
["Adjusted EBITA"]
[null,"Data by quarter"]
["SEK m",{"$f":"ActQ_Year","v":"Q1 2026"},{"$f":"m1Q_Q_Year","v":"Q4 2025"},{"$f":"m2Q_Q_Year","v":"Q3 2025"},{"$f":"m3Q_Q_Year","v":"Q2 2025"},{"$f":"m4Q_Q_Year","v":"Q1 2025"},{"$f":"m5Q_Q_Year","v":"Q4 2024"}]
["EBITA",573.60140362779703,805.95004150220132,769.01486058789715,833.3960507910017,679.55455383970002,872.08890452779747]
["Reversal of items affecting comparability, EBITA",65.10100877790002,9.8144965767999928,-9.9052749116999976,9.3707561854999994,20.114849885599998,-23]
["Adjusted EBITA",638.70241240569703,815.76453807900134,759.10958567619718,842.7668069765017,699.66940372530007,849.08890452779747]
[]
[]
["Adjusted EBITA-margin"]
[null,"Data by quarter"]
["SEK m",{"$f":"ActQ_Year","v":"Q1 2026"},{"$f":"m1Q_Q_Year","v":"Q4 2025"},{"$f":"m2Q_Q_Year","v":"Q3 2025"},{"$f":"m3Q_Q_Year","v":"Q2 2025"},{"$f":"m4Q_Q_Year","v":"Q1 2025"},{"$f":"m5Q_Q_Year","v":"Q4 2024"}]
["Adjusted EBITA",638.70241240569658,815.76453807899986,759.10958567619593,842.78180697650259,699.68440372529994,848.93192123909751]
["Net sales",7850.6631983933012,8723.0701356458012,7981.5310747240001,8452.0456289312024,7940.3509770985002,8590.7410444792986]
["Adjusted EBITA-margin, %",8.1356491326288456,9.3518053322244175,9.5108266643244974,9.9713352716847083,8.8117566306996302,9.8819405315988416]
[]
[]
["Adjusted EBITDA"]
[null,"Data by quarter"]
["SEK m",{"$f":"ActQ_Year","v":"Q1 2026"},{"$f":"m1Q_Q_Year","v":"Q4 2025"},{"$f":"m2Q_Q_Year","v":"Q3 2025"},{"$f":"m3Q_Q_Year","v":"Q2 2025"},{"$f":"m4Q_Q_Year","v":"Q1 2025"},{"$f":"m5Q_Q_Year","v":"Q4 2024"}]
["Operating profit",405.81142093779658,629.78133662869993,597.26577863479588,660.92348426780256,503.08571972839991,678.01286185469746]
["Reversal of items affecting comparability, EBITDA",65.114046777900015,9.8144965767999928,-9.9052749116999976,9.3707561855000012,20.114849885599998,-23.171983288699987]
["Amortisations and depreciations",415.87640841940009,440.17644898189997,438.30734225359998,432.3599619387,439.0535408623,453.50751408789995]
["Impairment",-1.30381231E-2,9.9999999999999995E-7,7.140000000000007E-8,6.4186010000000003E-3,6.4194655000000007E-3,1.2671161800000001E-2]
["Adjusted EBITDA",886.78883801199663,1079.7722820316999,1025.667846048096,1102.6606209930026,962.26052994179997,1108.3610638156974]
[]
[]
["Adjusted cash conversion (new definition 2025)"]
[null,"Data by quarter"]
["SEK m",{"$f":"ActQ_Year","v":"Q1 2026"},{"$f":"m1Q_Q_Year","v":"Q4 2025"},{"$f":"m2Q_Q_Year","v":"Q3 2025"},{"$f":"m3Q_Q_Year","v":"Q2 2025"},{"$f":"m4Q_Q_Year","v":"Q1 2025"},{"$f":"m5Q_Q_Year","v":"Q4 2024"}]
["Adjusted EBITDA",886.78883801199663,1079.7722820316999,1025.667846048096,1102.6606209930026,962.26052994179997,1108.3610638156974]
["Change in working capital",-247.6582241509,232.40575640970005,-88.342781798699946,-259.54314704189994,-435.92132540440025,621.30349498759995]
["Cash flow from net investments in non-current assets defined as CapEx",-105.56093976669999,-170.76136036170001,-112.1906926141,-110.1910128536,-149.25326962130001,-209]
["Operating cash flow",533.56967409439665,1141.4166780796998,825.13437163529602,732.92646109750262,377.08593491609975,1520.6645588032975]
["Adjusted EBITDA",886.78883801199663,1079.7722820316999,1025.667846048096,1102.6606209930026,962.26052994179997,1108.3610638156974]
["Adjusted cash conversion, %",60.168740428730835,105.70901819520778,80.448497514526125,66.468906855262915,39.187509326492574,137.19938460921608]
[]
[]
["Interest coverage ratio"]
[null,"Data by quarter"]
["SEK m",{"$f":"ActQ_Year","v":"Q1 2026"},{"$f":"m1Q_Q_Year","v":"Q4 2025"},{"$f":"m2Q_Q_Year","v":"Q3 2025"},{"$f":"m3Q_Q_Year","v":"Q2 2025"},{"$f":"m4Q_Q_Year","v":"Q1 2025"},{"$f":"m5Q_Q_Year","v":"Q4 2024"}]
["Operating profit",405.81142093779658,629.78133662869993,597.26577863479588,660.92348426780256,503.08571972839991,678.01286185469746]
["Interest income",11.4131716638,16.150652257199994,20.124982747800001,11.8429511809,12.922008744599999,-0.9364941081999989]
["Operating profit including interest income",417.22459260159656,645.93198888589995,617.39076138259588,672.76643544870251,516.00772847299993,677.07636774649745]
["Interest expenses  ",-143.45205830610001,-164.21672634970005,-158.72934292850005,-260.16604454409992,-184.52433157250002,-213.45577298299995]
["Interest coverage ratio, x",2.9084601331499678,3.9334116764109988,3.8895817874121787,2.5859117650330576,2.7964210685692654,3.171974963639991]
[]
[]
["Operating margin"]
[null,"Data by quarter"]
["SEK m",{"$f":"ActQ_Year","v":"Q1 2026"},{"$f":"m1Q_Q_Year","v":"Q4 2025"},{"$f":"m2Q_Q_Year","v":"Q3 2025"},{"$f":"m3Q_Q_Year","v":"Q2 2025"},{"$f":"m4Q_Q_Year","v":"Q1 2025"},{"$f":"m5Q_Q_Year","v":"Q4 2024"}]
["Operating profit",405.81142093779658,629.78133662869993,597.26577863479588,660.92348426780256,503.08571972839991,678.01286185469746]
["Net sales",7850.6631983933012,8723.0701356458012,7981.5310747240001,8452.0456289312024,7940.3509770985002,8590.7410444792986]
["Operating margin, %",5.1691355326623745,7.2197211169399225,7.4830978297663178,7.819686656748198,6.3358121218998491,7.8923675890616147]
[]
[]
["Items affecting comparability"]
[null,"Data by quarter"]
["SEK m",{"$f":"ActQ_Year","v":"Q1 2026"},{"$f":"m1Q_Q_Year","v":"Q4 2025"},{"$f":"m2Q_Q_Year","v":"Q3 2025"},{"$f":"m3Q_Q_Year","v":"Q2 2025"},{"$f":"m4Q_Q_Year","v":"Q1 2025"},{"$f":"m5Q_Q_Year","v":"Q4 2024"}]
["Remeasurement of contingent considerations",1.0156490000001184E-3,0.54742409780000756,10.127239975599998,-0.7375243672000007,-20.114849885599998,-2.1521840238000003]
["Stamp tax on foreign business combinations",1.3782960000000011E-3,-3.0082264129,9.9999999997324451E-7,9.9999999999999395E-5,0,9.6284449999966496E-4]
["Central restructuring costs",0,-5.8004395699999385E-2,0,-8.6187724338000002,0,4.3546710831000004]
["Capital gain/loss from divestment of business",-64.708440722900008,-7.0737238021,0,0,0,20.975033384899987]
["Items affecting comparability, EBITDA",-65.114046777900015,-9.8144965767999928,9.9052749116999976,-9.3707561855000012,-20.114849885599998,23.171983288699987]
["Impairment of tangible fixed assets",1.3037999999999999E-2,0,0,0,0,0]
["Items affecting comparability, EBITA",-65.10100877790002,-9.8144965767999928,9.9052749116999976,-9.3707561855000012,-20.114849885599998,23.171983288699987]
["Impairment of intangible fixed assets",0,0,0,0,0,0]
["Items affecting comparability, EBIT",-65.10100877790002,-9.8144965767999928,9.9052749116999976,-9.3707561855000012,-20.114849885599998,23.171983288699987]
["Financial one-off costs (related to divestment of business), before tax",0,0,0,0,0,0]
["One-off items related to refinancing of interest-bearing liabilities, before tax",0,0,0,-80.102105340000008,0,-11.6]
["Items affecting comparability, profit for the period",-65.10100877790002,-9.8144965767999928,9.9052749517000152,-89.472861525500008,-20.114849885599998,11.571983288699988]
[]
[]
["Adjusted diluted earnings per share"]
[null,"Data by quarter"]
[null,{"$f":"ActQ_Year","v":"Q1 2026"},{"$f":"m1Q_Q_Year","v":"Q4 2025"},{"$f":"m2Q_Q_Year","v":"Q3 2025"},{"$f":"m3Q_Q_Year","v":"Q2 2025"},{"$f":"m4Q_Q_Year","v":"Q1 2025"},{"$f":"m5Q_Q_Year","v":"Q4 2024"}]
["Net profit for the period attributable to owners of the parent company, SEK m",145.87949987899941,328.21666902039965,316.05108617279694,224.12205928540183,194.48923240380051,327.42022421979851]
["Reversal of items affecting comparability, SEK m",65.10100877790002,9.8144965767999928,-9.9052749517000152,89.472861525500008,20.114849885599998,-11.571983288699988]
["Total",210.98050865689942,338.03116559719962,306.14581122109695,313.59492081090184,214.60408228940051,315.84824093109853]
["Total weighted average number of shares after dilution, millions",1677.904663,1683.947719,1686.7272726312899,1686.7360940000001,1687.4567119999999,1686.9872800000001]
["Adjusted diluted earnings per share, SEK",0.12574046267901659,0.20073732799610725,0.18150285241046132,0.1859181895297142,0.12717605184375272,0.18722621366244002]

{"sheet":"SysAdmin","index":9,"n_rows":17,"n_cols":3,"rows_kept":17,"cut":false,"hidden":true,"merged":[]}
[]
[null,"Selinmatning",true]
[null,"SelDia",true]
[null,"SelPubl",true]
[null,"SelAdmOrg",true]
[null,"SelTxtdata",true]
[null,"SelLngNo",{"$f":"IF(Sel_Lang=\"ENG\",2,1)","v":2}]
[null,"SelMal",false]
[null,"TblTyp","OVR"]
[null,"Adm_ActiveSheet:","Nyckeltal_(P)"]
[null,"SelLangText","ENG"]
[null,"SelQuarter","Q1"]
[null,"HistoryStart",2021]
[null,"SelYear",2026]
[null,"Large Icons",false]
[null,"Versionsnr för verktyget","0.7"]
[null,"EnableRetrieve",true]