{"text_format":"1","workbook":"xlsx","n_sheets":10,"sheets":["PeriodAdmin","LanguageAdmin","Income statement - 6Q","Balance sheet - 6Q","Cash flow statement - 6Q","Net sales by vertical - 6Q","Quarterly data - 6Q","APM - 6Q","APM - calculations - 6Q","SysAdmin"],"not_rendered":{"charts":0,"images":0,"macros":1,"external_links":3,"defined_names":371,"comments":0,"pivot_tables":0},"unopened":[],"bounds":{"document_bytes":16777216,"sheet_cells":100000,"rows_first":2000,"rows_last":500,"rows_between":2000,"halvings":0,"cell_chars":16384,"cell_head_chars":4096},"cells_cut":0,"cells_raw":0,"read":"whole","date_system":"1900"}

{"sheet":"PeriodAdmin","index":0,"n_rows":191,"n_cols":19,"rows_kept":191,"cut":false,"hidden":true,"merged":[[169,7,184,7],[186,7,190,7],[72,7,87,7],[88,7,103,7],[104,7,119,7],[120,7,135,7],[136,7,151,7],[152,7,167,7],[56,7,71,7],[4,8,5,8],[4,9,5,9],[8,7,23,7],[24,7,39,7],[40,7,55,7]]}
[]
[null,null,null,null,null,null,null,null,null,null,"Q_No",{"$f":"VALUE(RIGHT(Sel_Quarter,1))","v":1}]
[null,null,null,null,null,null,null,null,null,null,"SelectIdx",{"$f":"Q_No+IF(Sel_Lang=\"ENG\",4,0)","v":5}]
[]
[null,null,null,null,null,null,null,null,"Namn","Rubrik till vald period"]
[null,null,null,null,null,null,null,null,null,null,"SWE",null,null,null,"ENG",null,null,null,"Divider"]
[null,null,"Name","Year","Name","Y",null,null,"ActPer_nMonth",{"$f":"INDEX(K7:R7,,SelectIdx)","v":"Three months"},"Tre månader","Sex månader","Nio månader","Helår","Three months","Six months","Nine months","Full-year"]
[null,null,"ActYear",2024,"ActY",{"$f":"VALUE(RIGHT(Sel_Year,2))","v":24},null,null,"ActPer_noMonth","3 months","3 månader","6 månader","9 månader","12 månader","3 months","6 months","9 months","12 months"]
[null,null,"ActYear_m1Y",{"$f":"D8-1","v":2023},"ActY_m1Y",{"$f":"TEXT(F8-1,\"00\")","v":"23"},null,"Perioden","ActQn",1,1,2,3,4,1,2,3,4]
[null,null,"ActYear_m2Y",{"$f":"D9-1","v":2022},"ActY_m2Y","22",null,null,"ActQ","Q1",{"$f":"\"Q\"&K9","v":"Q1"},"Q2","Q3","Q4","Q1","Q2","Q3","Q4"]
[null,null,"ActYear_m3Y",2021,"ActY_m3Y","21",null,null,"ActQ_Year","Q1 2024",{"$f":"K10&$S11&Sel_Year","v":"Q1 2024"},{"$f":"L10&$S11&Sel_Year","v":"Q2 2024"},"Q3 2024","Q4 2024","Q1 2024","Q2 2024","Q3 2024","Q4 2024"," "]
[null,null,"ActYear_m4Y",2020,"ActY_m4Y","20",null,null,"ActQ_Y","Q1 24",{"$f":"K10&$S12&ActY","v":"Q1 24"},"Q2 24","Q3 24","Q4 24","Q1 24","Q2 24","Q3 24","Q4 24"," "]
[null,null,"ActYear_m5Y",2019,"ActY_m5Y","19",null,null,"ActQn_Year","1 2024",{"$f":"K9&$S13&Sel_Year","v":"1 2024"},"2 2024","3 2024","4 2024","1 2024","2 2024","3 2024","4 2024"," "]
[null,null,"ActYear_m6Y",2018,"ActY_m6Y","18",null,null,"ActQn_Y","1 24",{"$f":"K9&$S14&ActY","v":"1 24"},"2 24","3 24","4 24","1 24","2 24","3 24","4 24"," "]
[null,null,"ActYear_m7Y",2017,"ActY_m7Y","17",null,null,"ActMon","03","03","06","09","12","03","06","09","12"]
[null,null,"ActYear_m8Y",2016,"ActY_m8Y","16",null,null,"ActYearMonth","2024 03",{"$f":"ActYear&$S16&K15","v":"2024 03"},"2024 06","2024 09","2024 12","2024 03","2024 06","2024 09","2024 12"," "]
[null,null,"ActYear_m9Y",2015,"ActY_m9Y","15",null,null,"ActQBrMDay","31 Mar","31 mar","30 jun","30 sep","31 dec","31 Mar","30 Jun","30 Sep","31 Dec"]
[null,null,"ActYear_m10Y",2014,"ActY_m10Y","14",null,null,"ActQBrDate","2024-03-31",{"$f":"EOMONTH(DATE(ActYear,K15,1),0)","v":"2024-03-31"},"2024-06-30","2024-09-30","2024-12-31","2024-03-31","2024-06-30","2024-09-30","2024-12-31"]
[null,null,null,null,null,null,null,null,"ActQBrDateYear","31 Mar 2024",{"$f":"K17&$S19&ActYear","v":"31 mar 2024"},"30 jun 2024","30 sep 2024","31 dec 2024","31 Mar 2024","30 Jun 2024","30 Sep 2024","31 Dec 2024"," "]
[null,null,"ActHYear",{"$f":"\"H1 \"&ActYear","v":"H1 2024"},null,null,null,null,"ActQBrDateY","31 Mar 24",{"$f":"K17&$S20&ActY","v":"31 mar 24"},"30 jun 24","30 sep 24","31 dec 24","31 Mar 24","30 Jun 24","30 Sep 24","31 Dec 24"," "]
[null,null,"ActHYear_m1Y",{"$f":"\"H1 \"&ActYear_m1Y","v":"H1 2023"},null,null,null,null,"ActPerYear","Jan-Mar 2024",{"$f":"K23&$S21&ActYear","v":"jan-mar 2024"},"apr-jun 2024","jul-sep 2024","okt-dec 2024","Jan-Mar 2024","Apr-Jun 2024","Jul-Sep 2024","Oct-Dec 2024"," "]
[null,null,null,null,null,null,null,null,"ActPerY",{"$f":"INDEX(K22:R22,,SelectIdx)","v":"Jan-Mar 24"},{"$f":"K23&$S21&ActY","v":"jan-mar 24"},"apr-jun 24","jul-sep 24","okt-dec 24","Jan-Mar 24","Apr-Jun 24","Jul-Sep 24","Oct-Dec 24"]
[null,null,"ActFullYear","jan-dec","Jan-Dec",{"$f":"IF(INDEX($D23:$E23,,SelLngNo)=0,\"\",INDEX($D23:$E23,,SelLngNo)) & \" \" & ActYear","v":"Jan-Dec 2024"},null,null,"ActPer","Jan-Mar","jan-mar","apr-jun","jul-sep","okt-dec","Jan-Mar","Apr-Jun","Jul-Sep","Oct-Dec"]
[null,null,"ActFullYear_m1Y","jan-dec","Jan-Dec",{"$f":"IF(INDEX($D24:$E24,,SelLngNo)=0,\"\",INDEX($D24:$E24,,SelLngNo))&\" \"&ActYear_m1Y","v":"Jan-Dec 2023"},null,null,"ActAckPer","Jan-Mar","jan-mar","jan-jun","jan-sep","jan-dec","Jan-Mar","Jan-Jun","Jan-Sep","Jan-Dec"]
[null,null,"FullYear","jan-dec","Jan-Dec",{"$f":"IF(INDEX($D25:$E25,,SelLngNo)=0,\"\",INDEX($D25:$E25,,SelLngNo))","v":"Jan-Dec"},null,"Perioden minus 1Q","m1Q_Qn",4,{"$f":"N9","v":4},{"$f":"K9","v":1},{"$f":"L9","v":2},{"$f":"M9","v":3},{"$f":"R9","v":4},{"$f":"O9","v":1},{"$f":"P9","v":2},{"$f":"Q9","v":3},{"$f":"IF(S9=\"\",\"\",S9)","v":""}]
[null,null,"FullYearBrDay","31 dec","31 Dec","31 Dec",null,null,"m1Q_Q","Q4",{"$f":"\"Q\"&K25","v":"Q4"},"Q1","Q2","Q3","Q4","Q1","Q2","Q3",""]
[null,null,"FullYearBrDate",{"$f":"DATE(ActYear,12,31)","v":"2024-12-31"},{"$f":"DATE(ActYear,12,31)","v":"2024-12-31"},"2024-12-31",null,null,"m1Q_Q_Year","Q4 2023",{"$f":"K26&$S27&ActYear_m1Y","v":"Q4 2023"},{"$f":"L26&$S27&Sel_Year","v":"Q1 2024"},{"$f":"M26&$S27&Sel_Year","v":"Q2 2024"},{"$f":"N26&$S27&Sel_Year","v":"Q3 2024"},{"$f":"O26&$S27&ActYear_m1Y","v":"Q4 2023"},{"$f":"P26&$S27&Sel_Year","v":"Q1 2024"},{"$f":"Q26&$S27&Sel_Year","v":"Q2 2024"},{"$f":"R26&$S27&Sel_Year","v":"Q3 2024"}," "]
[null,null,"ActFullYearM","jan-dec","Jan-Dec","Jan-Dec",null,null,"m1Q_Q_Y","Q4 23",{"$f":"K26&$S28&ActY_m1Y","v":"Q4 23"},{"$f":"L26&$S28&ActY","v":"Q1 24"},{"$f":"M26&$S28&ActY","v":"Q2 24"},{"$f":"N26&$S28&ActY","v":"Q3 24"},{"$f":"O26&$S28&ActY_m1Y","v":"Q4 23"},{"$f":"P26&$S28&ActY","v":"Q1 24"},{"$f":"Q26&$S28&ActY","v":"Q2 24"},{"$f":"R26&$S28&ActY","v":"Q3 24"}," "]
[null,null,"ActFullYearM_1Y","jan-dec","Jan-Dec","Jan-Dec",null,null,"m1Q_Qn_Year","4 2023",{"$f":"K25&$S29&ActYear_m1Y","v":"4 2023"},{"$f":"L25&$S29&Sel_Year","v":"1 2024"},{"$f":"M25&$S29&Sel_Year","v":"2 2024"},{"$f":"N25&$S29&Sel_Year","v":"3 2024"},{"$f":"O25&$S29&ActYear_m1Y","v":"4 2023"},{"$f":"P25&$S29&ActYear","v":"1 2024"},{"$f":"Q25&$S29&Sel_Year","v":"2 2024"},{"$f":"R25&$S29&Sel_Year","v":"3 2024"}," "]
[null,null,"FullYearBrDate_1Y",{"$f":"DATE(ActYear_m1Y,12,31)","v":"2023-12-31"},{"$f":"DATE(ActYear_m1Y,12,31)","v":"2023-12-31"},"2023-12-31",null,null,"m1Q_Qn_Y","4 23",{"$f":"K25&$S30&ActY_m1Y","v":"4 23"},{"$f":"L25&$S30&ActY","v":"1 24"},{"$f":"M25&$S30&ActY","v":"2 24"},{"$f":"N25&$S30&ActY","v":"3 24"},{"$f":"O25&$S30&ActY_m1Y","v":"4 23"},{"$f":"P25&$S30&ActY","v":"1 24"},{"$f":"Q25&$S30&ActY","v":"2 24"},{"$f":"R25&$S30&ActY","v":"3 24"}," "]
[null,null,"FullYearBrDate_2Y",{"$f":"DATE(ActYear_m2Y,12,31)","v":"2022-12-31"},{"$f":"DATE(ActYear_m2Y,12,31)","v":"2022-12-31"},"2022-12-31",null,null,"m1Q_Mon","12",{"$f":"N15","v":"12"},{"$f":"K15","v":"03"},{"$f":"L15","v":"06"},{"$f":"M15","v":"09"},{"$f":"R15","v":"12"},{"$f":"O15","v":"03"},{"$f":"P15","v":"06"},{"$f":"Q15","v":"09"},""]
[null,null,"FullYearBrDate_3Y",{"$f":"DATE(ActYear_m3Y,12,31)","v":"2021-12-31"},{"$f":"DATE(ActYear_m3Y,12,31)","v":"2021-12-31"},"2021-12-31",null,null,"m1Q_YearMonth","2023 12",{"$f":"ActYear_m1Y&$S32&K31","v":"2023 12"},{"$f":"ActYear&$S32&L31","v":"2024 03"},{"$f":"ActYear&$S32&M31","v":"2024 06"},{"$f":"ActYear&$S32&N31","v":"2024 09"},{"$f":"ActYear_m1Y&$S32&O31","v":"2023 12"},{"$f":"ActYear&$S32&P31","v":"2024 03"},{"$f":"ActYear&$S32&Q31","v":"2024 06"},{"$f":"ActYear&$S32&R31","v":"2024 09"}," "]
[null,null,null,null,null,null,null,null,"m1Q_QBrMDay","31 Dec",{"$f":"N17","v":"31 dec"},{"$f":"K17","v":"31 mar"},{"$f":"L17","v":"30 jun"},{"$f":"M17","v":"30 sep"},{"$f":"R17","v":"31 Dec"},{"$f":"O17","v":"31 Mar"},{"$f":"P17","v":"30 Jun"},{"$f":"Q17","v":"30 Sep"},""]
[null,null,"FullYearT","Helår","Full-year",{"$f":"IF(INDEX($D34:$E34,,SelLngNo)=0,\"\",INDEX($D34:$E34,,SelLngNo))","v":"Full-year"},null,null,"m1Q_QBrDate","2023-12-31",{"$f":"EOMONTH(DATE(ActYear_m1Y,K31,1),0)","v":"2023-12-31"},{"$f":"EOMONTH(DATE(ActYear,L31,1),0)","v":"2024-03-31"},{"$f":"EOMONTH(DATE(ActYear,M31,1),0)","v":"2024-06-30"},{"$f":"EOMONTH(DATE(ActYear,N31,1),0)","v":"2024-09-30"},{"$f":"EOMONTH(DATE(ActYear_m1Y,O31,1),0)","v":"2023-12-31"},{"$f":"EOMONTH(DATE(ActYear,P31,1),0)","v":"2024-03-31"},{"$f":"EOMONTH(DATE(ActYear,Q31,1),0)","v":"2024-06-30"},{"$f":"EOMONTH(DATE(ActYear,R31,1),0)","v":"2024-09-30"},""]
[null,null,"QuarterT","Kvartal","Quarter",{"$f":"IF(INDEX($D35:$E35,,SelLngNo)=0,\"\",INDEX($D35:$E35,,SelLngNo))","v":"Quarter"},null,null,"m1Q_QBrDateYear","31 Dec 2023",{"$f":"K33&$S35&ActYear_m1Y","v":"31 dec 2023"},{"$f":"L33&$S35&ActYear","v":"31 mar 2024"},{"$f":"M33&$S35&ActYear","v":"30 jun 2024"},{"$f":"N33&$S35&ActYear","v":"30 sep 2024"},{"$f":"O33&$S35&ActYear_m1Y","v":"31 Dec 2023"},{"$f":"P33&$S35&ActYear","v":"31 Mar 2024"},{"$f":"Q33&$S35&ActYear","v":"30 Jun 2024"},{"$f":"R33&$S35&ActYear","v":"30 Sep 2024"}," "]
[null,null,"Txt_R12","R12","LTM",{"$f":"IF(INDEX($D36:$E36,,SelLngNo)=0,\"\",INDEX($D36:$E36,,SelLngNo))","v":"LTM"},null,null,"m1Q_QBrDateY","31 Dec 23",{"$f":"K33&$S36&ActY_m1Y","v":"31 dec 23"},{"$f":"L33&$S36&ActY","v":"31 mar 24"},{"$f":"M33&$S36&ActY","v":"30 jun 24"},{"$f":"N33&$S36&ActY","v":"30 sep 24"},{"$f":"O33&$S36&ActY_m1Y","v":"31 Dec 23"},{"$f":"P33&$S36&ActY","v":"31 Mar 24"},{"$f":"Q33&$S36&ActY","v":"30 Jun 24"},{"$f":"R33&$S36&ActY","v":"30 Sep 24"}," "]
[null,null,"Act_R12_Year",null,null,{"$f":"RIGHT(ActYear_m1Y,2)&\"/\"&RIGHT(ActYear,2)","v":"23/24"},null,null,"m1Q_PerYear","Oct-Dec 2023",{"$f":"K39&$S37&ActYear_m1Y","v":"okt-dec 2023"},{"$f":"L39&$S37&ActYear","v":"jan-mar 2024"},{"$f":"M39&$S37&ActYear","v":"apr-jun 2024"},{"$f":"N39&$S37&ActYear","v":"jul-sep 2024"},{"$f":"O39&$S37&ActYear_m1Y","v":"Oct-Dec 2023"},{"$f":"P39&$S37&ActYear","v":"Jan-Mar 2024"},{"$f":"Q39&$S37&ActYear","v":"Apr-Jun 2024"},{"$f":"R39&$S37&ActYear","v":"Jul-Sep 2024"}," "]
[null,null,null,null,null,null,null,null,"m1Q_PerY","Oct-Dec 23",{"$f":"K39&$S37&ActY_m1Y","v":"okt-dec 23"},{"$f":"L39&$S37&ActY","v":"jan-mar 24"},{"$f":"M39&$S37&ActY","v":"apr-jun 24"},{"$f":"N39&$S37&ActY","v":"jul-sep 24"},{"$f":"O39&$S37&ActY_m1Y","v":"Oct-Dec 23"},{"$f":"P39&$S37&ActY","v":"Jan-Mar 24"},{"$f":"Q39&$S37&ActY","v":"Apr-Jun 24"},{"$f":"R39&$S37&ActY","v":"Jul-Sep 24"},""]
[null,null,"AARO_Act",{"$f":"ActYear&\"-\"&ActMon","v":"2024-03"},{"$f":"(RIGHT(ActYear,2))&ActMon&\"A\"","v":"2403A"},null,null,null,"m1Q_Per",{"$f":"INDEX(K39:R39,,SelectIdx)","v":"Oct-Dec"},{"$f":"N23","v":"okt-dec"},{"$f":"K23","v":"jan-mar"},"apr-jun","jul-sep",{"$f":"R23","v":"Oct-Dec"},{"$f":"O23","v":"Jan-Mar"},"Apr-Jun","Jul-Sep",""]
[null,null,"AARO_m1Q",{"$f":"RIGHT(m1Q_Q_Year,4)&\"-\"&m1Q_Mon","v":"2023-12"},{"$f":"RIGHT(m1Q_Q_Year,2)&m1Q_Mon&\"A\"","v":"2312A"},null,null,null,"m1Q_AckPer","Jan-Dec",{"$f":"N24","v":"jan-dec"},"jan-mar","jan-jun","jan-sep",{"$f":"R24","v":"Jan-Dec"},"Jan-Mar","Jan-Jun","Jan-Sep",""]
[null,null,"AARO_m2Q",{"$f":"RIGHT(m2Q_Q_Year,4)&\"-\"&m2Q_Mon","v":"2023-09"},{"$f":"RIGHT(m2Q_Q_Year,2)&m2Q_Mon&\"A\"","v":"2309A"},null,null,"Perioden minus 2Q","m2Q_Qn",3,{"$f":"N25","v":3},4,1,2,{"$f":"R25","v":3},4,1,2,""]
[null,null,"AARO_m3Q",{"$f":"RIGHT(m3Q_Q_Year,4)&\"-\"&m3Q_Mon","v":"2023-06"},{"$f":"RIGHT(m3Q_Q_Year,2)&m3Q_Mon&\"A\"","v":"2306A"},null,null,null,"m2Q_Q","Q3",{"$f":"\"Q\"&K41","v":"Q3"},"Q4","Q1","Q2","Q3","Q4","Q1","Q2",""]
[null,null,"AARO_m4Q",{"$f":"RIGHT(m4Q_Q_Year,4)&\"-\"&m4Q_Mon","v":"2023-03"},{"$f":"RIGHT(m4Q_Q_Year,2)&m4Q_Mon&\"A\"","v":"2303A"},null,null,null,"m2Q_Q_Year","Q3 2023",{"$f":"K42&$S43&ActYear_m1Y","v":"Q3 2023"},{"$f":"K27","v":"Q4 2023"},"Q1 2024","Q2 2024",{"$f":"O42&$S43&ActYear_m1Y","v":"Q3 2023"},{"$f":"O27","v":"Q4 2023"},{"$f":"P27","v":"Q1 2024"},{"$f":"Q27","v":"Q2 2024"}," "]
[null,null,"AARO_m5Q",{"$f":"RIGHT(m5Q_Q_Year,4)&\"-\"&m5Q_Mon","v":"2022-12"},{"$f":"RIGHT(m5Q_Q_Year,2)&m5Q_Mon&\"A\"","v":"2212A"},null,null,null,"m2Q_Q_Y","Q3 23",{"$f":"K42&$S44&ActY_m1Y","v":"Q3 23"},"Q4 23","Q1 24","Q2 24",{"$f":"O42&$S44&ActY_m1Y","v":"Q3 23"},{"$f":"O28","v":"Q4 23"},{"$f":"P27","v":"Q1 2024"},{"$f":"Q27","v":"Q2 2024"}," "]
[null,null,"AARO_m6Q",{"$f":"RIGHT(m6Q_Q_Year,4)&\"-\"&m6Q_Mon","v":"2022-09"},{"$f":"RIGHT(m6Q_Q_Year,2)&m6Q_Mon&\"A\"","v":"2209A"},null,null,null,"m2Q_Qn_Year","3 2023",{"$f":"K41&$S45&ActYear_m1Y","v":"3 2023"},"4 2023","1 2024","2 2024",{"$f":"O41&$S45&ActYear_m1Y","v":"3 2023"},"4 2023",{"$f":"P29","v":"1 2024"},"2 2024"," "]
[null,null,"AARO_m7Q",{"$f":"RIGHT(m7Q_Q_Year,4)&\"-\"&m7Q_Mon","v":"2022-06"},{"$f":"RIGHT(m7Q_Q_Year,2)&m7Q_Mon&\"A\"","v":"2206A"},null,null,null,"m2Q_Qn_Y","3 23",{"$f":"K41&$S46&ActY_m1Y","v":"3 23"},"4 23","1 24","2 24",{"$f":"O41&$S46&ActY_m1Y","v":"3 23"},"4 23","1 24","2 24"," "]
[null,null,"AARO_m8Q",{"$f":"RIGHT(m8Q_Q_Year,4)&\"-\"&m8Q_Mon","v":"2022-03"},{"$f":"RIGHT(m8Q_Q_Year,2)&m8Q_Mon&\"A\"","v":"2203A"},null,null,null,"m2Q_Mon","09",{"$f":"N31","v":"09"},"12","03","06",{"$f":"R31","v":"09"},"12","03","06",""]
[null,null,"AARO_m9Q",{"$f":"RIGHT(m9Q_Q_Year,4)&\"-\"&m9Q_Mon","v":"2021-12"},{"$f":"RIGHT(m9Q_Q_Year,2)&m9Q_Mon&\"A\"","v":"2112A"},null,null,null,"m2Q_YearMonth","2023 09",{"$f":"ActYear_m1Y&$S48&K47","v":"2023 09"},"2023 12","2024 03","2024 06",{"$f":"ActYear_m1Y&$S48&O47","v":"2023 09"},"2023 12","2024 03","2024 06"," "]
[null,null,null,null,null,null,null,null,"m2Q_QBrMDay","30 Sep",{"$f":"N33","v":"30 sep"},"31 dec","31 mar","30 jun",{"$f":"R33","v":"30 Sep"},"31 Dec","31 Mar","30 Jun",""]
[null,null,"AARO_PY_Act",{"$f":"ActYear_m1Y&\"-\"&ActMon","v":"2023-03"},null,null,null,null,"m2Q_QBrDate","2023-09-30",{"$f":"EOMONTH(DATE(ActYear_m1Y,K47,1),0)","v":"2023-09-30"},"2023-12-31","2024-03-31","2024-06-30",{"$f":"EOMONTH(DATE(ActYear_m1Y,O47,1),0)","v":"2023-09-30"},"2023-12-31","2024-03-31","2024-06-30",""]
[null,null,"AARO_PY_Full",{"$f":"ActYear_m1Y&\"-12\"","v":"2023-12"},null,null,null,null,"m2Q_QBrDateYear","30 Sep 2023",{"$f":"K49&$S51&ActYear_m1Y","v":"30 sep 2023"},"31 dec 2023","31 mar 2024","30 jun 2024",{"$f":"O49&$S51&ActYear_m1Y","v":"30 Sep 2023"},"31 Dec 2023","31 Mar 2024","30 Jun 2024"," "]
[null,null,null,null,null,null,null,null,"m2Q_QBrDateY","30 Sep 23",{"$f":"K49&$S52&ActY_m1Y","v":"30 sep 23"},"31 dec 23","31 mar 24","30 jun 24",{"$f":"O49&$S52&ActY_m1Y","v":"30 Sep 23"},"31 Dec 23","31 Mar 24","30 Jun 24"," "]
[null,null,"MtchNt","IdxNt",null,null,null,null,"m2Q_PerYear","Jul-Sep 2023",{"$f":"K55&$S53&ActYear_m1Y","v":"jul-sep 2023"},"okt-dec 2023","jan-mar 2024","apr-jun 2024",{"$f":"O55&$S53&ActYear_m1Y","v":"Jul-Sep 2023"},"Oct-Dec 2023","Jan-Mar 2024","Apr-Jun 2024"," "]
[null,null,null,null,null,null,null,null,"m2Q_PerY","Jul-Sep 23",{"$f":"K55&$S53&ActY_m1Y","v":"jul-sep 23"},"okt-dec 23","jan-mar 24","apr-jun 24",{"$f":"O55&$S53&ActY_m1Y","v":"Jul-Sep 23"},"Oct-Dec 23","Jan-Mar 24","Apr-Jun 24",""]
[null,null,1,"¹",null,null,null,null,"m2Q_Per","Jul-Sep",{"$f":"N39","v":"jul-sep"},"okt-dec","jan-mar","apr-jun",{"$f":"R39","v":"Jul-Sep"},"Oct-Dec","Jan-Mar","Apr-Jun",""]
[null,null,2,"²",null,null,null,null,"m2Q_AckPer","Jan-Sep",{"$f":"N40","v":"jan-sep"},"jan-dec","jan-mar","jan-jun",{"$f":"R40","v":"Jan-Sep"},"Jan-Dec","Jan-Mar","Jan-Jun",""]
[null,null,3,"³",null,null,null,"Perioden minus 3Q","m3Q_Qn",2,{"$f":"N41","v":2},3,4,1,{"$f":"R41","v":2},3,4,1,{"$f":"IF(S41=\"\",\"\",S41)","v":""}]
[null,null,4,"⁴",null,null,null,null,"m3Q_Q","Q2",{"$f":"\"Q\"&K57","v":"Q2"},"Q3","Q4","Q1","Q2","Q3","Q4","Q1",""]
[null,null,5,"⁵",null,null,null,null,"m3Q_Q_Year","Q2 2023",{"$f":"K58&$S59&ActYear_m1Y","v":"Q2 2023"},{"$f":"K43","v":"Q3 2023"},"Q4 2023","Q1 2024",{"$f":"O58&$S59&ActYear_m1Y","v":"Q2 2023"},{"$f":"O43","v":"Q3 2023"},{"$f":"P43","v":"Q4 2023"},{"$f":"Q43","v":"Q1 2024"}," "]
[null,null,6,"⁶",null,null,null,null,"m3Q_Q_Y","Q2 23",{"$f":"K58&$S60&ActY_m1Y","v":"Q2 23"},"Q3 23","Q4 23","Q1 24",{"$f":"O58&$S60&ActY_m1Y","v":"Q2 23"},{"$f":"O44","v":"Q3 23"},{"$f":"P43","v":"Q4 2023"},{"$f":"Q43","v":"Q1 2024"}," "]
[null,null,7,"⁷",null,null,null,null,"m3Q_Qn_Year","2 2023",{"$f":"K57&$S61&ActYear_m1Y","v":"2 2023"},"3 2023","4 2023","1 2024",{"$f":"O57&$S61&ActYear_m1Y","v":"2 2023"},"3 2023",{"$f":"P45","v":"4 2023"},"1 2024"," "]
[null,null,8,"⁸",null,null,null,null,"m3Q_Qn_Y","2 23",{"$f":"K57&$S62&ActY_m1Y","v":"2 23"},"3 23","4 23","1 24",{"$f":"O57&$S62&ActY_m1Y","v":"2 23"},"3 23","4 23","1 24"," "]
[null,null,9,"⁹",null,null,null,null,"m3Q_Mon","06",{"$f":"N47","v":"06"},"09","12","03",{"$f":"R47","v":"06"},"09","12","03",""]
[null,null,null,null,null,null,null,null,"m3Q_YearMonth","2023 06",{"$f":"ActYear_m1Y&$S64&K63","v":"2023 06"},"2023 09","2023 12","2024 03",{"$f":"ActYear_m1Y&$S64&O63","v":"2023 06"},"2023 09","2023 12","2024 03"," "]
[null,null,"BR_Dat_Txt_Start",{"$f":"ActYear&\"-01-01\"","v":"2024-01-01"},null,null,null,null,"m3Q_QBrMDay","30 Jun",{"$f":"N49","v":"30 jun"},"30 sep","31 dec","31 mar",{"$f":"R49","v":"30 Jun"},"30 Sep","31 Dec","31 Mar",""]
[null,null,"BR_Dat_Txt_Slut",{"$f":"ActYear&\"-\"&ActMon&\"-\"&LEFT(ActQBrMDay,2)","v":"2024-03-31"},null,null,null,null,"m3Q_QBrDate","2023-06-30",{"$f":"EOMONTH(DATE(ActYear_m1Y,K63,1),0)","v":"2023-06-30"},"2023-09-30","2023-12-31","2024-03-31",{"$f":"EOMONTH(DATE(ActYear_m1Y,O63,1),0)","v":"2023-06-30"},"2023-09-30","2023-12-31","2024-03-31",""]
[null,null,"BR_Dat_Txt_Start_1Y",{"$f":"ActYear_m1Y&\"-01-01\"","v":"2023-01-01"},null,null,null,null,"m3Q_QBrDateYear","30 Jun 2023",{"$f":"K65&$S67&ActYear_m1Y","v":"30 jun 2023"},"30 sep 2023","31 dec 2023","31 mar 2024",{"$f":"O65&$S67&ActYear_m1Y","v":"30 Jun 2023"},"30 Sep 2023","31 Dec 2023","31 Mar 2024"," "]
[null,null,"BR_Dat_Txt_Slut_1Y",{"$f":"ActYear_m1Y&\"-\"&ActMon&\"-\"&LEFT(ActQBrMDay,2)","v":"2023-03-31"},null,null,null,null,"m3Q_QBrDateY","30 Jun 23",{"$f":"K65&$S68&ActY_m1Y","v":"30 jun 23"},"30 sep 23","31 dec 23","31 mar 24",{"$f":"O65&$S68&ActY_m1Y","v":"30 Jun 23"},"30 Sep 23","31 Dec 23","31 Mar 24"," "]
[null,null,null,null,null,null,null,null,"m3Q_PerYear","Apr-Jun 2023",{"$f":"K71&$S69&ActYear_m1Y","v":"apr-jun 2023"},"jul-sep 2023","okt-dec 2023","jan-mar 2024",{"$f":"O71&$S69&ActYear_m1Y","v":"Apr-Jun 2023"},"Jul-Sep 2023","Oct-Dec 2023","Jan-Mar 2024"," "]
[null,null,null,null,null,null,null,null,"m3Q_PerY","Apr-Jun 23",{"$f":"K71&$S69&ActY_m1Y","v":"apr-jun 23"},"jul-sep 23","okt-dec 23","jan-mar 24",{"$f":"O71&$S69&ActY_m1Y","v":"Apr-Jun 23"},"Jul-Sep 23","Oct-Dec 23","Jan-Mar 24",""]
[null,null,"RowHeight1",1,1,null,null,null,"m3Q_Per",{"$f":"INDEX(K71:R71,,SelectIdx)","v":"Apr-Jun"},{"$f":"N55","v":"apr-jun"},"jul-sep","okt-dec","jan-mar",{"$f":"R55","v":"Apr-Jun"},"Jul-Sep","Oct-Dec","Jan-Mar",""]
[null,null,"RowHeight2",2,2,null,null,null,"m3Q_AckPer","Jan-Jun",{"$f":"N56","v":"jan-jun"},"jan-sep","jan-dec","jan-mar",{"$f":"R56","v":"Jan-Jun"},"Jan-Sep","Jan-Dec","Jan-Mar",""]
[null,null,"RowHeight3",3,2,null,null,"Perioden minus 4Q","m4Q_Qn",1,{"$f":"N57","v":1},2,3,4,{"$f":"R57","v":1},2,3,4,""]
[null,null,"RowHeight4",4,3,null,null,null,"m4Q_Q","Q1",{"$f":"\"Q\"&K73","v":"Q1"},"Q2","Q3","Q4","Q1","Q2","Q3","Q4",""]
[null,null,"RowHeightIdx",{"$f":"INDEX(E71:E74,MATCH(Q_No,D71:D74,0))","v":1},null,null,null,null,"m4Q_Q_Year","Q1 2023",{"$f":"K74&$S75&ActYear_m1Y","v":"Q1 2023"},{"$f":"K59","v":"Q2 2023"},"Q3 2023","Q4 2023",{"$f":"O74&$S75&ActYear_m1Y","v":"Q1 2023"},{"$f":"O59","v":"Q2 2023"},{"$f":"P59","v":"Q3 2023"},{"$f":"Q59","v":"Q4 2023"}," "]
[null,null,null,null,null,null,null,null,"m4Q_Q_Y","Q1 23",{"$f":"K74&$S76&ActY_m1Y","v":"Q1 23"},"Q2 23","Q3 23","Q4 23",{"$f":"O74&$S76&ActY_m1Y","v":"Q1 23"},{"$f":"O60","v":"Q2 23"},{"$f":"P59","v":"Q3 2023"},{"$f":"Q59","v":"Q4 2023"}," "]
[null,null,"Wd_Sidft_Txt_1","1 jan - ","1 Jan - ",{"$f":"IF(INDEX($D77:$E77,,SelLngNo)=0,\"\",INDEX($D77:$E77,,SelLngNo))&ActQBrDateYear","v":"1 Jan - 31 Mar 2024"},null,null,"m4Q_Qn_Year","1 2023",{"$f":"K73&$S77&ActYear_m1Y","v":"1 2023"},"2 2023","3 2023","4 2023",{"$f":"O73&$S77&ActYear_m1Y","v":"1 2023"},"2 2023",{"$f":"P61","v":"3 2023"},"4 2023"," "]
[null,null,null,null,null,null,null,null,"m4Q_Qn_Y","1 23",{"$f":"K73&$S78&ActY_m1Y","v":"1 23"},"2 23","3 23","4 23",{"$f":"O73&$S78&ActY_m1Y","v":"1 23"},"2 23","3 23","4 23"," "]
[null,null,null,null,null,null,null,null,"m4Q_Mon","03",{"$f":"N63","v":"03"},"06","09","12",{"$f":"R63","v":"03"},"06","09","12",""]
[null,null,null,null,null,null,null,null,"m4Q_YearMonth","2023 03",{"$f":"ActYear_m1Y&$S80&K79","v":"2023 03"},"2023 06","2023 09","2023 12",{"$f":"ActYear_m1Y&$S80&O79","v":"2023 03"},"2023 06","2023 09","2023 12"," "]
[null,null,null,null,null,null,null,null,"m4Q_QBrMDay","31 Mar",{"$f":"N65","v":"31 mar"},"30 jun","30 sep","31 dec",{"$f":"R65","v":"31 Mar"},"30 Jun","30 Sep","31 Dec",""]
[null,null,null,null,null,null,null,null,"m4Q_QBrDate","2023-03-31",{"$f":"EOMONTH(DATE(ActYear_m1Y,K79,1),0)","v":"2023-03-31"},"2023-06-30","2023-09-30","2023-12-31",{"$f":"EOMONTH(DATE(ActYear_m1Y,O79,1),0)","v":"2023-03-31"},"2023-06-30","2023-09-30","2023-12-31",""]
[null,null,null,null,null,null,null,null,"m4Q_QBrDateYear","31 Mar 2023",{"$f":"K81&$S83&ActYear_m1Y","v":"31 mar 2023"},"30 jun 2023","30 sep 2023","31 dec 2023",{"$f":"O81&$S83&ActYear_m1Y","v":"31 Mar 2023"},"30 Jun 2023","30 Sep 2023","31 Dec 2023"," "]
[null,null,null,null,null,null,null,null,"m4Q_QBrDateY","31 Mar 23",{"$f":"K81&$S84&ActY_m1Y","v":"31 mar 23"},"30 jun 23","30 sep 23","31 dec 23",{"$f":"O81&$S84&ActY_m1Y","v":"31 Mar 23"},"30 Jun 23","30 Sep 23","31 Dec 23"," "]
[null,null,null,null,null,null,null,null,"m4Q_PerYear","Jan-Mar 2023",{"$f":"K87&$S85&ActYear_m1Y","v":"jan-mar 2023"},"apr-jun 2023","jul-sep 2023","okt-dec 2023",{"$f":"O87&$S85&ActYear_m1Y","v":"Jan-Mar 2023"},"Apr-Jun 2023","Jul-Sep 2023","Oct-Dec 2023"," "]
[null,null,null,null,null,null,null,null,"m4Q_PerY","Jan-Mar 23",{"$f":"K87&$S85&ActY_m1Y","v":"jan-mar 23"},"apr-jun 23","jul-sep 23","okt-dec 23",{"$f":"O87&$S85&ActY_m1Y","v":"Jan-Mar 23"},"Apr-Jun 23","Jul-Sep 23","Oct-Dec 23",""]
[null,null,null,null,null,null,null,null,"m4Q_Per","Jan-Mar",{"$f":"N71","v":"jan-mar"},"apr-jun","jul-sep","okt-dec",{"$f":"R71","v":"Jan-Mar"},"Apr-Jun","Jul-Sep","Oct-Dec",""]
[null,null,null,null,null,null,null,null,"m4Q_AckPer","Jan-Mar",{"$f":"N72","v":"jan-mar"},"jan-jun","jan-sep","jan-dec",{"$f":"R72","v":"Jan-Mar"},"Jan-Jun","Jan-Sep","Jan-Dec",""]
[null,null,null,null,null,null,null,"Perioden minus 5Q","m5Q_Qn",4,{"$f":"N73","v":4},1,2,3,{"$f":"R73","v":4},1,2,3,{"$f":"IF(S73=\"\",\"\",S73)","v":""}]
[null,null,null,null,null,null,null,null,"m5Q_Q","Q4",{"$f":"\"Q\"&K89","v":"Q4"},"Q1","Q2","Q3","Q4","Q1","Q2","Q3",""]
[null,null,null,null,null,null,null,null,"m5Q_Q_Year","Q4 2022",{"$f":"K90&$S91&ActYear_m2Y","v":"Q4 2022"},{"$f":"K75","v":"Q1 2023"},"Q2 2023","Q3 2023",{"$f":"O90&$S91&ActYear_m2Y","v":"Q4 2022"},{"$f":"O75","v":"Q1 2023"},{"$f":"P75","v":"Q2 2023"},{"$f":"Q75","v":"Q3 2023"}," "]
[null,null,null,null,null,null,null,null,"m5Q_Q_Y","Q4 22",{"$f":"K90&$S92&ActY_m2Y","v":"Q4 22"},"Q1 23","Q2 23","Q3 23",{"$f":"O90&$S92&ActY_m2Y","v":"Q4 22"},{"$f":"O76","v":"Q1 23"},{"$f":"P75","v":"Q2 2023"},{"$f":"Q75","v":"Q3 2023"}," "]
[null,null,null,null,null,null,null,null,"m5Q_Qn_Year","4 2022",{"$f":"K89&$S93&ActYear_m2Y","v":"4 2022"},"1 2023","2 2023","3 2023",{"$f":"O89&$S93&ActYear_m2Y","v":"4 2022"},"1 2023",{"$f":"P77","v":"2 2023"},"3 2023"," "]
[null,null,null,null,null,null,null,null,"m5Q_Qn_Y","4 22",{"$f":"K89&$S94&ActY_m2Y","v":"4 22"},"1 23","2 23","3 23",{"$f":"O89&$S94&ActY_m2Y","v":"4 22"},"1 23","2 23","3 23"," "]
[null,null,null,null,null,null,null,null,"m5Q_Mon","12",{"$f":"N79","v":"12"},"03","06","09",{"$f":"R79","v":"12"},"03","06","09",""]
[null,null,null,null,null,null,null,null,"m5Q_YearMonth","2022 12",{"$f":"ActYear_m2Y&$S96&K95","v":"2022 12"},"2023 03","2023 06","2023 09",{"$f":"ActYear_m2Y&$S96&O95","v":"2022 12"},"2023 03","2023 06","2023 09"," "]
[null,null,null,null,null,null,null,null,"m5Q_QBrMDay","31 Dec",{"$f":"N81","v":"31 dec"},"31 mar","30 jun","30 sep",{"$f":"R81","v":"31 Dec"},"31 Mar","30 Jun","30 Sep",""]
[null,null,null,null,null,null,null,null,"m5Q_QBrDate","2022-12-31",{"$f":"EOMONTH(DATE(ActYear_m2Y,K95,1),0)","v":"2022-12-31"},"2023-03-31","2023-06-30","2023-09-30",{"$f":"EOMONTH(DATE(ActYear_m2Y,O95,1),0)","v":"2022-12-31"},"2023-03-31","2023-06-30","2023-09-30",""]
[null,null,null,null,null,null,null,null,"m5Q_QBrDateYear","31 Dec 2022",{"$f":"K97&$S99&ActYear_m2Y","v":"31 dec 2022"},"31 mar 2023","30 jun 2023","30 sep 2023",{"$f":"O97&$S99&ActYear_m2Y","v":"31 Dec 2022"},"31 Mar 2023","30 Jun 2023","30 Sep 2023"," "]
[null,null,null,null,null,null,null,null,"m5Q_QBrDateY","31 Dec 22",{"$f":"K97&$S100&ActY_m2Y","v":"31 dec 22"},"31 mar 23","30 jun 23","30 sep 23",{"$f":"O97&$S100&ActY_m2Y","v":"31 Dec 22"},"31 Mar 23","30 Jun 23","30 Sep 23"," "]
[null,null,null,null,null,null,null,null,"m5Q_PerYear","Oct-Dec 2022",{"$f":"K103&$S101&ActYear_m2Y","v":"okt-dec 2022"},"jan-mar 2023","apr-jun 2023","jul-sep 2023",{"$f":"O103&$S101&ActYear_m2Y","v":"Oct-Dec 2022"},"Jan-Mar 2023","Apr-Jun 2023","Jul-Sep 2023"," "]
[null,null,null,null,null,null,null,null,"m5Q_PerY","Oct-Dec 22",{"$f":"K103&$S101&ActY_m2Y","v":"okt-dec 22"},"jan-mar 23","apr-jun 23","jul-sep 23",{"$f":"O103&$S101&ActY_m2Y","v":"Oct-Dec 22"},"Jan-Mar 23","Apr-Jun 23","Jul-Sep 23",""]
[null,null,null,null,null,null,null,null,"m5Q_Per",{"$f":"INDEX(K103:R103,,SelectIdx)","v":"Oct-Dec"},{"$f":"N87","v":"okt-dec"},"jan-mar","apr-jun","jul-sep",{"$f":"R87","v":"Oct-Dec"},"Jan-Mar","Apr-Jun","Jul-Sep",""]
[null,null,null,null,null,null,null,null,"m5Q_AckPer","Jan-Dec",{"$f":"N88","v":"jan-dec"},"jan-mar","jan-jun","jan-sep",{"$f":"R88","v":"Jan-Dec"},"Jan-Mar","Jan-Jun","Jan-Sep",""]
[null,null,null,null,null,null,null,"Perioden minus 6Q","m6Q_Qn",3,{"$f":"N89","v":3},4,1,2,{"$f":"R89","v":3},4,1,2,""]
[null,null,null,null,null,null,null,null,"m6Q_Q","Q3",{"$f":"\"Q\"&K105","v":"Q3"},"Q4","Q1","Q2","Q3","Q4","Q1","Q2",""]
[null,null,null,null,null,null,null,null,"m6Q_Q_Year","Q3 2022",{"$f":"K106&$S107&ActYear_m2Y","v":"Q3 2022"},{"$f":"K91","v":"Q4 2022"},"Q1 2023","Q2 2023",{"$f":"O106&$S107&ActYear_m2Y","v":"Q3 2022"},{"$f":"O91","v":"Q4 2022"},{"$f":"P91","v":"Q1 2023"},{"$f":"Q91","v":"Q2 2023"}," "]
[null,null,null,null,null,null,null,null,"m6Q_Q_Y","Q3 22",{"$f":"K106&$S108&ActY_m2Y","v":"Q3 22"},"Q4 22","Q1 23","Q2 23",{"$f":"O106&$S108&ActY_m2Y","v":"Q3 22"},{"$f":"O92","v":"Q4 22"},{"$f":"P91","v":"Q1 2023"},{"$f":"Q91","v":"Q2 2023"}," "]
[null,null,null,null,null,null,null,null,"m6Q_Qn_Year","3 2022",{"$f":"K105&$S109&ActYear_m2Y","v":"3 2022"},"4 2022","1 2023","2 2023",{"$f":"O105&$S109&ActYear_m2Y","v":"3 2022"},"4 2022",{"$f":"P93","v":"1 2023"},"2 2023"," "]
[null,null,null,null,null,null,null,null,"m6Q_Qn_Y","3 22",{"$f":"K105&$S110&ActY_m2Y","v":"3 22"},"4 22","1 23","2 23",{"$f":"O105&$S110&ActY_m2Y","v":"3 22"},"4 22","1 23","2 23"," "]
[null,null,null,null,null,null,null,null,"m6Q_Mon","09",{"$f":"N95","v":"09"},"12","03","06",{"$f":"R95","v":"09"},"12","03","06",""]
[null,null,null,null,null,null,null,null,"m6Q_YearMonth","2022 09",{"$f":"ActYear_m2Y&$S112&K111","v":"2022 09"},"2022 12","2023 03","2023 06",{"$f":"ActYear_m2Y&$S112&O111","v":"2022 09"},"2022 12","2023 03","2023 06"," "]
[null,null,null,null,null,null,null,null,"m6Q_QBrMDay","30 Sep",{"$f":"N97","v":"30 sep"},"31 dec","31 mar","30 jun",{"$f":"R97","v":"30 Sep"},"31 Dec","31 Mar","30 Jun",""]
[null,null,null,null,null,null,null,null,"m6Q_QBrDate","2022-09-30",{"$f":"EOMONTH(DATE(ActYear_m2Y,K111,1),0)","v":"2022-09-30"},"2022-12-31","2023-03-31","2023-06-30",{"$f":"EOMONTH(DATE(ActYear_m2Y,O111,1),0)","v":"2022-09-30"},"2022-12-31","2023-03-31","2023-06-30",""]
[null,null,null,null,null,null,null,null,"m6Q_QBrDateYear","30 Sep 2022",{"$f":"K113&$S115&ActYear_m2Y","v":"30 sep 2022"},"31 dec 2022","31 mar 2023","30 jun 2023",{"$f":"O113&$S115&ActYear_m2Y","v":"30 Sep 2022"},"31 Dec 2022","31 Mar 2023","30 Jun 2023"," "]
[null,null,null,null,null,null,null,null,"m6Q_QBrDateY","30 Sep 22",{"$f":"K113&$S116&ActY_m2Y","v":"30 sep 22"},"31 dec 22","31 mar 23","30 jun 23",{"$f":"O113&$S116&ActY_m2Y","v":"30 Sep 22"},"31 Dec 22","31 Mar 23","30 Jun 23"," "]
[null,null,null,null,null,null,null,null,"m6Q_PerYear","Jul-Sep 2022",{"$f":"K119&$S117&ActYear_m2Y","v":"jul-sep 2022"},"okt-dec 2022","jan-mar 2023","apr-jun 2023",{"$f":"O119&$S117&ActYear_m2Y","v":"Jul-Sep 2022"},"Oct-Dec 2022","Jan-Mar 2023","Apr-Jun 2023"," "]
[null,null,null,null,null,null,null,null,"m6Q_PerY","Jul-Sep 22",{"$f":"K119&$S117&ActY_m2Y","v":"jul-sep 22"},"okt-dec 22","jan-mar 23","apr-jun 23",{"$f":"O119&$S117&ActY_m2Y","v":"Jul-Sep 22"},"Oct-Dec 22","Jan-Mar 23","Apr-Jun 23",""]
[null,null,null,null,null,null,null,null,"m6Q_Per","Jul-Sep",{"$f":"N103","v":"jul-sep"},"okt-dec","jan-mar","apr-jun",{"$f":"R103","v":"Jul-Sep"},"Oct-Dec","Jan-Mar","Apr-Jun",""]
[null,null,null,null,null,null,null,null,"m6Q_AckPer","Jan-Sep",{"$f":"N104","v":"jan-sep"},"jan-dec","jan-mar","jan-jun",{"$f":"R104","v":"Jan-Sep"},"Jan-Dec","Jan-Mar","Jan-Jun",""]
[null,null,null,null,null,null,null,"Perioden minus 7Q","m7Q_Qn",2,{"$f":"N105","v":2},3,4,1,{"$f":"R105","v":2},3,4,1,{"$f":"IF(S105=\"\",\"\",S105)","v":""}]
[null,null,null,null,null,null,null,null,"m7Q_Q","Q2",{"$f":"\"Q\"&K121","v":"Q2"},"Q3","Q4","Q1","Q2","Q3","Q4","Q1",""]
[null,null,null,null,null,null,null,null,"m7Q_Q_Year","Q2 2022",{"$f":"K122&$S123&ActYear_m2Y","v":"Q2 2022"},{"$f":"K107","v":"Q3 2022"},"Q4 2022","Q1 2023",{"$f":"O122&$S123&ActYear_m2Y","v":"Q2 2022"},{"$f":"O107","v":"Q3 2022"},{"$f":"P107","v":"Q4 2022"},{"$f":"Q107","v":"Q1 2023"}," "]
[null,null,null,null,null,null,null,null,"m7Q_Q_Y","Q2 22",{"$f":"K122&$S124&ActY_m2Y","v":"Q2 22"},"Q3 22","Q4 22","Q1 23",{"$f":"O122&$S124&ActY_m2Y","v":"Q2 22"},{"$f":"O108","v":"Q3 22"},{"$f":"P107","v":"Q4 2022"},{"$f":"Q107","v":"Q1 2023"}," "]
[null,null,null,null,null,null,null,null,"m7Q_Qn_Year","2 2022",{"$f":"K121&$S125&ActYear_m2Y","v":"2 2022"},"3 2022","4 2022","1 2023",{"$f":"O121&$S125&ActYear_m2Y","v":"2 2022"},"3 2022",{"$f":"P109","v":"4 2022"},"1 2023"," "]
[null,null,null,null,null,null,null,null,"m7Q_Qn_Y","2 22",{"$f":"K121&$S126&ActY_m2Y","v":"2 22"},"3 22","4 22","1 23",{"$f":"O121&$S126&ActY_m2Y","v":"2 22"},"3 22","4 22","1 23"," "]
[null,null,null,null,null,null,null,null,"m7Q_Mon","06",{"$f":"N111","v":"06"},"09","12","03",{"$f":"R111","v":"06"},"09","12","03",""]
[null,null,null,null,null,null,null,null,"m7Q_YearMonth","2022 06",{"$f":"ActYear_m2Y&$S128&K127","v":"2022 06"},"2022 09","2022 12","2023 03",{"$f":"ActYear_m2Y&$S128&O127","v":"2022 06"},"2022 09","2022 12","2023 03"," "]
[null,null,null,null,null,null,null,null,"m7Q_QBrMDay","30 Jun",{"$f":"N113","v":"30 jun"},"30 sep","31 dec","31 mar",{"$f":"R113","v":"30 Jun"},"30 Sep","31 Dec","31 Mar",""]
[null,null,null,null,null,null,null,null,"m7Q_QBrDate","2022-06-30",{"$f":"EOMONTH(DATE(ActYear_m2Y,K127,1),0)","v":"2022-06-30"},"2022-09-30","2022-12-31","2023-03-31",{"$f":"EOMONTH(DATE(ActYear_m2Y,O127,1),0)","v":"2022-06-30"},"2022-09-30","2022-12-31","2023-03-31",""]
[null,null,null,null,null,null,null,null,"m7Q_QBrDateYear","30 Jun 2022",{"$f":"K129&$S131&ActYear_m2Y","v":"30 jun 2022"},"30 sep 2022","31 dec 2022","31 mar 2023",{"$f":"O129&$S131&ActYear_m2Y","v":"30 Jun 2022"},"30 Sep 2022","31 Dec 2022","31 Mar 2023"," "]
[null,null,null,null,null,null,null,null,"m7Q_QBrDateY","30 Jun 22",{"$f":"K129&$S132&ActY_m2Y","v":"30 jun 22"},"30 sep 22","31 dec 22","31 mar 23",{"$f":"O129&$S132&ActY_m2Y","v":"30 Jun 22"},"30 Sep 22","31 Dec 22","31 Mar 23"," "]
[null,null,null,null,null,null,null,null,"m7Q_PerYear","Apr-Jun 2022",{"$f":"K135&$S133&ActYear_m2Y","v":"apr-jun 2022"},"jul-sep 2022","okt-dec 2022","jan-mar 2023",{"$f":"O135&$S133&ActYear_m2Y","v":"Apr-Jun 2022"},"Jul-Sep 2022","Oct-Dec 2022","Jan-Mar 2023"," "]
[null,null,null,null,null,null,null,null,"m7Q_PerY","Apr-Jun 22",{"$f":"K135&$S133&ActY_m2Y","v":"apr-jun 22"},"jul-sep 22","okt-dec 22","jan-mar 23",{"$f":"O135&$S133&ActY_m2Y","v":"Apr-Jun 22"},"Jul-Sep 22","Oct-Dec 22","Jan-Mar 23",""]
[null,null,null,null,null,null,null,null,"m7Q_Per",{"$f":"INDEX(K135:R135,,SelectIdx)","v":"Apr-Jun"},{"$f":"N119","v":"apr-jun"},"jul-sep","okt-dec","jan-mar",{"$f":"R119","v":"Apr-Jun"},"Jul-Sep","Oct-Dec","Jan-Mar",""]
[null,null,null,null,null,null,null,null,"m7Q_AckPer","Jan-Jun",{"$f":"N120","v":"jan-jun"},"jan-sep","jan-dec","jan-mar",{"$f":"R120","v":"Jan-Jun"},"Jan-Sep","Jan-Dec","Jan-Mar",""]
[null,null,null,null,null,null,null,"Perioden minus 8Q","m8Q_Qn",1,{"$f":"N121","v":1},2,3,4,{"$f":"R121","v":1},2,3,4,""]
[null,null,null,null,null,null,null,null,"m8Q_Q","Q1",{"$f":"\"Q\"&K137","v":"Q1"},"Q2","Q3","Q4","Q1","Q2","Q3","Q4",""]
[null,null,null,null,null,null,null,null,"m8Q_Q_Year","Q1 2022",{"$f":"K138&$S139&ActYear_m2Y","v":"Q1 2022"},{"$f":"K123","v":"Q2 2022"},"Q3 2022","Q4 2022",{"$f":"O138&$S139&ActYear_m2Y","v":"Q1 2022"},{"$f":"O123","v":"Q2 2022"},{"$f":"P123","v":"Q3 2022"},{"$f":"Q123","v":"Q4 2022"}," "]
[null,null,null,null,null,null,null,null,"m8Q_Q_Y","Q1 22",{"$f":"K138&$S140&ActY_m2Y","v":"Q1 22"},"Q2 22","Q3 22","Q4 22",{"$f":"O138&$S140&ActY_m2Y","v":"Q1 22"},{"$f":"O124","v":"Q2 22"},{"$f":"P123","v":"Q3 2022"},{"$f":"Q123","v":"Q4 2022"}," "]
[null,null,null,null,null,null,null,null,"m8Q_Qn_Year","1 2022",{"$f":"K137&$S141&ActYear_m2Y","v":"1 2022"},"2 2022","3 2022","4 2022",{"$f":"O137&$S141&ActYear_m2Y","v":"1 2022"},"2 2022",{"$f":"P125","v":"3 2022"},"4 2022"," "]
[null,null,null,null,null,null,null,null,"m8Q_Qn_Y","1 22",{"$f":"K137&$S142&ActY_m2Y","v":"1 22"},"2 22","3 22","4 22",{"$f":"O137&$S142&ActY_m2Y","v":"1 22"},"2 22","3 22","4 22"," "]
[null,null,null,null,null,null,null,null,"m8Q_Mon","03",{"$f":"N127","v":"03"},"06","09","12",{"$f":"R127","v":"03"},"06","09","12",""]
[null,null,null,null,null,null,null,null,"m8Q_YearMonth","2022 03",{"$f":"ActYear_m2Y&$S144&K143","v":"2022 03"},"2022 06","2022 09","2022 12",{"$f":"ActYear_m2Y&$S144&O143","v":"2022 03"},"2022 06","2022 09","2022 12"," "]
[null,null,null,null,null,null,null,null,"m8Q_QBrMDay","31 Mar",{"$f":"N129","v":"31 mar"},"30 jun","30 sep","31 dec",{"$f":"R129","v":"31 Mar"},"30 Jun","30 Sep","31 Dec",""]
[null,null,null,null,null,null,null,null,"m8Q_QBrDate","2022-03-31",{"$f":"EOMONTH(DATE(ActYear_m2Y,K143,1),0)","v":"2022-03-31"},"2022-06-30","2022-09-30","2022-12-31",{"$f":"EOMONTH(DATE(ActYear_m2Y,O143,1),0)","v":"2022-03-31"},"2022-06-30","2022-09-30","2022-12-31",""]
[null,null,null,null,null,null,null,null,"m8Q_QBrDateYear","31 Mar 2022",{"$f":"K145&$S147&ActYear_m2Y","v":"31 mar 2022"},"30 jun 2022","30 sep 2022","31 dec 2022",{"$f":"O145&$S147&ActYear_m2Y","v":"31 Mar 2022"},"30 Jun 2022","30 Sep 2022","31 Dec 2022"," "]
[null,null,null,null,null,null,null,null,"m8Q_QBrDateY","31 Mar 22",{"$f":"K145&$S148&ActY_m2Y","v":"31 mar 22"},"30 jun 22","30 sep 22","31 dec 22",{"$f":"O145&$S148&ActY_m2Y","v":"31 Mar 22"},"30 Jun 22","30 Sep 22","31 Dec 22"," "]
[null,null,null,null,null,null,null,null,"m8Q_PerYear","Jan-Mar 2022",{"$f":"K151&$S149&ActYear_m2Y","v":"jan-mar 2022"},"apr-jun 2022","jul-sep 2022","okt-dec 2022",{"$f":"O151&$S149&ActYear_m2Y","v":"Jan-Mar 2022"},"Apr-Jun 2022","Jul-Sep 2022","Oct-Dec 2022"," "]
[null,null,null,null,null,null,null,null,"m8Q_PerY","Jan-Mar 22",{"$f":"K151&$S149&ActY_m2Y","v":"jan-mar 22"},"apr-jun 22","jul-sep 22","okt-dec 22",{"$f":"O151&$S149&ActY_m2Y","v":"Jan-Mar 22"},"Apr-Jun 22","Jul-Sep 22","Oct-Dec 22",""]
[null,null,null,null,null,null,null,null,"m8Q_Per","Jan-Mar",{"$f":"N135","v":"jan-mar"},"apr-jun","jul-sep","okt-dec",{"$f":"R135","v":"Jan-Mar"},"Apr-Jun","Jul-Sep","Oct-Dec",""]
[null,null,null,null,null,null,null,null,"m8Q_AckPer","Jan-Mar",{"$f":"N136","v":"jan-mar"},"jan-jun","jan-sep","jan-dec",{"$f":"R136","v":"Jan-Mar"},"Jan-Jun","Jan-Sep","Jan-Dec",""]
[null,null,null,null,null,null,null,"Perioden minus 9Q","m9Q_Qn",4,{"$f":"N137","v":4},1,2,3,{"$f":"R137","v":4},1,2,3,{"$f":"IF(S137=\"\",\"\",S137)","v":""}]
[null,null,null,null,null,null,null,null,"m9Q_Q","Q4",{"$f":"\"Q\"&K153","v":"Q4"},"Q1","Q2","Q3","Q4","Q1","Q2","Q3",""]
[null,null,null,null,null,null,null,null,"m9Q_Q_Year","Q4 2021",{"$f":"K154&$S155&ActYear_m3Y","v":"Q4 2021"},{"$f":"K139","v":"Q1 2022"},"Q2 2022","Q3 2022",{"$f":"O154&$S155&ActYear_m3Y","v":"Q4 2021"},{"$f":"O139","v":"Q1 2022"},{"$f":"P139","v":"Q2 2022"},{"$f":"Q139","v":"Q3 2022"}," "]
[null,null,null,null,null,null,null,null,"m9Q_Q_Y","Q4 21",{"$f":"K154&$S156&ActY_m3Y","v":"Q4 21"},"Q1 22","Q2 22","Q3 22",{"$f":"O154&$S156&ActY_m3Y","v":"Q4 21"},{"$f":"O140","v":"Q1 22"},{"$f":"P139","v":"Q2 2022"},{"$f":"Q139","v":"Q3 2022"}," "]
[null,null,null,null,null,null,null,null,"m9Q_Qn_Year","4 2021",{"$f":"K153&$S157&ActYear_m3Y","v":"4 2021"},"1 2022","2 2022","3 2022",{"$f":"O153&$S157&ActYear_m3Y","v":"4 2021"},"1 2022",{"$f":"P141","v":"2 2022"},"3 2022"," "]
[null,null,null,null,null,null,null,null,"m9Q_Qn_Y","4 21",{"$f":"K153&$S158&ActY_m3Y","v":"4 21"},"1 22","2 22","3 22",{"$f":"O153&$S158&ActY_m3Y","v":"4 21"},"1 22","2 22","3 22"," "]
[null,null,null,null,null,null,null,null,"m9Q_Mon","12",{"$f":"N143","v":"12"},"03","06","09",{"$f":"R143","v":"12"},"03","06","09",""]
[null,null,null,null,null,null,null,null,"m9Q_YearMonth","2021 12",{"$f":"ActYear_m3Y&$S160&K159","v":"2021 12"},"2022 03","2022 06","2022 09",{"$f":"ActYear_m3Y&$S160&O159","v":"2021 12"},"2022 03","2022 06","2022 09"," "]
[null,null,null,null,null,null,null,null,"m9Q_QBrMDay","31 Dec",{"$f":"N145","v":"31 dec"},"31 mar","30 jun","30 sep",{"$f":"R145","v":"31 Dec"},"31 Mar","30 Jun","30 Sep",""]
[null,null,null,null,null,null,null,null,"m9Q_QBrDate","2021-12-31",{"$f":"EOMONTH(DATE(ActYear_m3Y,K159,1),0)","v":"2021-12-31"},"2022-03-31","2022-06-30","2022-09-30",{"$f":"EOMONTH(DATE(ActYear_m3Y,O159,1),0)","v":"2021-12-31"},"2022-03-31","2022-06-30","2022-09-30",""]
[null,null,null,null,null,null,null,null,"m9Q_QBrDateYear","31 Dec 2021",{"$f":"K161&$S163&ActYear_m3Y","v":"31 dec 2021"},"31 mar 2022","30 jun 2022","30 sep 2022",{"$f":"O161&$S163&ActYear_m3Y","v":"31 Dec 2021"},"31 Mar 2022","30 Jun 2022","30 Sep 2022"," "]
[null,null,null,null,null,null,null,null,"m9Q_QBrDateY","31 Dec 21",{"$f":"K161&$S164&ActY_m3Y","v":"31 dec 21"},"31 mar 22","30 jun 22","30 sep 22",{"$f":"O161&$S164&ActY_m3Y","v":"31 Dec 21"},"31 Mar 22","30 Jun 22","30 Sep 22"," "]
[null,null,null,null,null,null,null,null,"m9Q_PerYear","Oct-Dec 2021",{"$f":"K167&$S165&ActYear_m3Y","v":"okt-dec 2021"},"jan-mar 2022","apr-jun 2022","jul-sep 2022",{"$f":"O167&$S165&ActYear_m3Y","v":"Oct-Dec 2021"},"Jan-Mar 2022","Apr-Jun 2022","Jul-Sep 2022"," "]
[null,null,null,null,null,null,null,null,"m9Q_PerY","Oct-Dec 21",{"$f":"K167&$S165&ActY_m3Y","v":"okt-dec 21"},"jan-mar 22","apr-jun 22","jul-sep 22",{"$f":"O167&$S165&ActY_m3Y","v":"Oct-Dec 21"},"Jan-Mar 22","Apr-Jun 22","Jul-Sep 22",""]
[null,null,null,null,null,null,null,null,"m9Q_Per",{"$f":"INDEX(K167:R167,,SelectIdx)","v":"Oct-Dec"},{"$f":"N151","v":"okt-dec"},"jan-mar","apr-jun","jul-sep",{"$f":"R151","v":"Oct-Dec"},"Jan-Mar","Apr-Jun","Jul-Sep",""]
[null,null,null,null,null,null,null,null,"m9Q_AckPer","Jan-Dec",{"$f":"N152","v":"jan-dec"},"jan-mar","jan-jun","jan-sep",{"$f":"R152","v":"Jan-Dec"},"Jan-Mar","Jan-Jun","Jan-Sep",""]
[]
[null,null,null,null,null,null,null,"Perioden minus 1 Year","m1Y_ActQn",{"$f":"INDEX(K170:R170,,SelectIdx)","v":1},1,2,3,4,1,2,3,4,{"$f":"IF(S153=\"\",\"\",S153)","v":""}]
[null,null,null,null,null,null,null,null,"m1Y_ActQ","Q1",{"$f":"\"Q\"&K170","v":"Q1"},"Q2","Q3","Q4","Q1","Q2","Q3","Q4",""]
[null,null,null,null,null,null,null,null,"m1Y_ActQ_Year","Q1 2023",{"$f":"K171&$S11&ActYear_m1Y","v":"Q1 2023"},"Q2 2023","Q3 2023","Q4 2023","Q1 2023","Q2 2023","Q3 2023","Q4 2023"," "]
[null,null,null,null,null,null,null,null,"m1Y_ActQ_Y","Q1 23",{"$f":"K171&$S12&ActY_m1Y","v":"Q1 23"},"Q2 23","Q3 23","Q4 23","Q1 23","Q2 23","Q3 23","Q4 23"," "]
[null,null,null,null,null,null,null,null,"m1Y_ActQn_Year","1 2023",{"$f":"K170&$S13&ActYear_m1Y","v":"1 2023"},"2 2023","3 2023","4 2023","1 2023","2 2023","3 2023","4 2023"," "]
[null,null,null,null,null,null,null,null,"m1Y_ActQn_Y","1 23",{"$f":"K170&$S14&ActY_m1Y","v":"1 23"},"2 23","3 23","4 23","1 23","2 23","3 23","4 23"," "]
[null,null,null,null,null,null,null,null,"m1Y_ActMon","03","03","06","09","12","03","06","09","12",""]
[null,null,null,null,null,null,null,null,"m1Y_ActYearMonth","2023 03",{"$f":"ActYear_m1Y&$S16&K176","v":"2023 03"},"2023 06","2023 09","2023 12","2023 03","2023 06","2023 09","2023 12"," "]
[null,null,null,null,null,null,null,null,"m1Y_ActQBrMDay","31 Mar","31 mar","30 jun","30 sep","31 dec","31 Mar","30 Jun","30 Sep","31 Dec",""]
[null,null,null,null,null,null,null,null,"m1Y_ActQBrDate","2023-03-31",{"$f":"EOMONTH(DATE(ActYear_m1Y,K176,1),0)","v":"2023-03-31"},"2023-06-30","2023-09-30","2023-12-31","2023-03-31","2023-06-30","2023-09-30","2023-12-31",""]
[null,null,null,null,null,null,null,null,"m1Y_ActQBrDateYear","31 Mar 2023",{"$f":"K178&$S19&ActYear_m1Y","v":"31 mar 2023"},"30 jun 2023","30 sep 2023","31 dec 2023","31 Mar 2023","30 Jun 2023","30 Sep 2023","31 Dec 2023"," "]
[null,null,null,null,null,null,null,null,"m1Y_ActQBrDateY","31 Mar 23",{"$f":"K178&$S20&ActY_m1Y","v":"31 mar 23"},"30 jun 23","30 sep 23","31 dec 23","31 Mar 23","30 Jun 23","30 Sep 23","31 Dec 23"," "]
[null,null,null,null,null,null,null,null,"m1Y_ActPerYear","Jan-Mar 2023",{"$f":"K184&$S21&ActYear_m1Y","v":"jan-mar 2023"},"apr-jun 2023","jul-sep 2023","okt-dec 2023","Jan-Mar 2023","Apr-Jun 2023","Jul-Sep 2023","Oct-Dec 2023"," "]
[null,null,null,null,null,null,null,null,"m1Y_ActPerY","Jan-Mar 23",{"$f":"K184&$S21&ActY_m1Y","v":"jan-mar 23"},"apr-jun 23","jul-sep 23","okt-dec 23","Jan-Mar 23","Apr-Jun 23","Jul-Sep 23","Oct-Dec 23",""]
[null,null,null,null,null,null,null,null,"m1Y_ActPer","Jan-Mar","jan-mar","apr-jun","jul-sep","okt-dec","Jan-Mar","Apr-Jun","Jul-Sep","Oct-Dec",""]
[null,null,null,null,null,null,null,null,"m1Y_ActAckPer","Jan-Mar","jan-mar","jan-jun","jan-sep","jan-dec","Jan-Mar","Jan-Jun","Jan-Sep","Jan-Dec",""]
[]
[null,null,null,null,null,null,null,"Rullande 12 mån",null,{"$f":"INDEX(K187:R187,,SelectIdx)","v":1},1,2,3,4,1,2,3,4,{"$f":"IF(S170=\"\",\"\",S170)","v":""}]
[null,null,null,null,null,null,null,null,"ActQBrDateR12Start",{"$f":"INDEX(K188:R188,,SelectIdx)","v":"1 Apr"},"1 apr","1 jul","1 okt","1 jan","1 Apr","1 Jul","1 Oct","1 Jan",{"$f":"IF(S177=\"\",\"\",S177)","v":" "}]
[null,null,null,null,null,null,null,null,"ActQBrDateR12Slut",{"$f":"INDEX(K189:R189,,SelectIdx)","v":"31 Mar"},{"$f":"K17","v":"31 mar"},"30 jun","30 sep","31 dec","31 Mar","30 Jun","30 Sep","31 Dec",{"$f":"IF(S178=\"\",\"\",S178)","v":""}]
[null,null,null,null,null,null,null,null,"ActQBrDateR12",{"$f":"INDEX(K190:R190,,SelectIdx)","v":"1 Apr 23 - 31 Mar 24"},{"$f":"K188&$S$190&ActY_m1Y&\" - \"&K189&$S$190&ActY","v":"1 apr 23 - 31 mar 24"},{"$f":"L188&$S$190&ActY_m1Y&\" - \"&L189&$S$190&ActY","v":"1 jul 23 - 30 jun 24"},{"$f":"M188&$S$190&ActY_m1Y&\" - \"&M189&$S$190&ActY","v":"1 okt 23 - 30 sep 24"},{"$f":"N188&$S$190&ActY&\" - \"&N189&$S$190&ActY","v":"1 jan 24 - 31 dec 24"},{"$f":"O188&$S$190&ActY_m1Y&\" - \"&O189&$S$190&ActY","v":"1 Apr 23 - 31 Mar 24"},{"$f":"P188&$S$190&ActY_m1Y&\" - \"&P189&$S$190&ActY","v":"1 Jul 23 - 30 Jun 24"},{"$f":"Q188&$S$190&ActY_m1Y&\" - \"&Q189&$S$190&ActY","v":"1 Oct 23 - 30 Sep 24"},{"$f":"R188&$S$190&ActY&\" - \"&R189&$S$190&ActY","v":"1 Jan 24 - 31 Dec 24"},{"$f":"IF(S182=\"\",\"\",S182)","v":" "}]
[null,null,null,null,null,null,null,null,"ActAckPerR12",{"$f":"INDEX(K191:R191,,SelectIdx)","v":"Apr-Mar"},"apr-mar","jul-jun","okt-sep","jan-dec","Apr-Mar","Jul-Jun","Oct-Sep","Jan-Dec",{"$f":"IF(S185=\"\",\"\",S185)","v":""}]

{"sheet":"LanguageAdmin","index":1,"n_rows":243,"n_cols":2,"rows_kept":243,"cut":false,"hidden":true,"merged":[]}
["SWE","ENG"]
["%","%"]
["[Land A]","[Country A]"]
["[Land B]","[Country B]"]
["[Land C] ","[Country C]"]
["[Övrigt, specificera]","[Other, specify]"]
["[Övrigt]","[Other]"]
["[Segment 1]","[Segment 1]"]
["[Segment 2]","[Segment 2]"]
["[Segment 3]","[Segment 3]"]
["[Specificera]","[Specify]"]
["Kundfordringar","Accounts receivable"]
["Förvärv av finansiella anläggningstillgångar","Acquisition of financial assets"]
["Förvärv av dotterföretag ","Acquisition of subsidiaries"]
["Justeringar och elimineringar","Adjustments and eliminations"]
["Justering för poster som inte ingår i kassaflödet","Adjustments for non-cash items"]
["Amortering av leasingskuld","Amortisation leasing"]
["Bokslutsdispositioner","Appropriations"]
["TILLGÅNGAR","Assets"]
["Tillgångar per segment","Assets per segment"]
["Hänförligt till moderföretagets aktieägare","Attributable to parent company´s shareholders"]
["Nedskrivning för föväntade kreditförluster","Bad debts loss"]
["Upptagna lån","Borrowings"]
["Varumärke","Brand"]
["Balanserade utgifter för utvecklingsarbeten och liknande arbeten","Capitalised expenses for development work and equivalent work"]
["Kassa och bank ","Cash and cash equivalents"]
["Likvida medel","Cash and cash equivalents"]
["Likvida medel ","Cash and cash equivalents"]
["Likvida medel vid periodens början","Cash and cash equivalents at the beginning of the period"]
["Likvida medel vid periodens slut","Cash and cash equivalents at the end of the period"]
["Kassaflöde","Cash flow"]
["Periodens kassaflöde","Cash flow for (-used in) the period"]
["Kassaflöde från investeringsverksamheten","Cash flow from (-used in) investing activities"]
["Kassaflöde från finansieringsverksamheten","Cash flow from financing activities"]
["Kassaflöde från löpande verksamhet","Cash flow from operating activities"]
["Kassaflöde från den löpande verksamheten före förändringar av rörelsekapital","Cash flow from operations"]
["Kassaflödespåverkan av förvärvet","Cash flow impact of the acquisition"]
["Centrala omkostnader ","Central overhead costs"]
["Ökning (-)/Minskning (+) av varulager","Change in inventories"]
["Ökning (+)/Minskning (-) av rörelseskulder","Change in other operating liabilities"]
["Ökning (-)/Minskning (+) av rörelsefordringar","Change in trade recievables"]
["Skuld på balansdagen","Closing balance liabilities"]
["Utgående eget kapital ","Closing equity"]
["Periodens totalresultat","Comprehensive income for the period"]
["Periodens totalresultat, efter skatt ","Comprehensive income for the period, after tax"]
["Koncessioner, patent, licenser, varumärken samt liknande rättigheter","Concessions, patents, licenses, trademarks and similar rights"]
["Konsoliderat","Consolidated"]
["Avtalstillgångar","Contract assets"]
["Avtalsskulder","Contract liabilities"]
["Omsättningstillgångar","Current assets"]
["Kortfristiga skulder","Current liabilities"]
["Kortfristiga skulder till kreditinstitut ","Current liabilities to credit institutions"]
["Kortfristiga fordringar","Current receivables"]
["Aktuell skatteskuld","Current tax liability"]
["Skulder per segment","Debt per segment"]
["Uppskjuten skattefordran ","Deferred tax asset"]
["Uppskjuten skatteskuld","Deferred tax asset"]
["Uppskjutna skatteskulder","Deferred tax liabilities"]
["Uppskjutna skattefordringar","Deferred tax receivables"]
["Danmark","Denmark"]
["Av- och nedskrivningar ","Depreciation and amortization"]
["Avskrivningar och nedskrivningar","Depreciation and amortization"]
["Avskrivningar och nedskrivningar av materiella och immateriella tillgångar","Depreciation and amortization of tangible and intangible fixed assets"]
["Avyttring av materiella anläggningstillgångar","Divestments of tangible assets"]
["Utdelning","Dividends to shareholders"]
["Resultat per aktie","Earnings per share"]
["Resultat per aktie efter utspädning (SEK)","Earnings per share after dilution, SEK"]
["Resultat per aktie före utspädning (SEK)","Earnings per share before dilution, SEK"]
["Rörelseresultat ","EBIT"]
["EBITDA","EBITDA"]
["Resultat efter finansiella poster ","EBT"]
["Personalkostnader","Employee benefits expense"]
["Inventarier, verktyg och installationer","Equipment, tools and installations"]
["Eget kapital","Equity"]
["Eget kapital och skulder","Equity and liabilities"]
["Eget kapital per stamaktie (kr)","Equity per share (kr)"]
["Kursdifferens i likvida medel","Exchange difference in cash and cash equivalents"]
["Extern försäljning","External sales"]
["Verkligt värde","Fair value"]
["Finansiella anläggningstillgångar","Financial assets"]
["Finansiella tillgångar","Financial assets"]
["Finansiella tillgångar värderade till verkligt värde via resultatet ","Financial assets reported at fair value via income statement"]
["Finansiella tillgångar värderade till upplupet anskaffningsvärde ","Financial assets reported at net historical acquisition cost"]
["Finansiella kostnader","Financial expenses"]
["Finansiella intäkter","Financial income"]
["Resultat från finansiella poster ","Financial income and expenses"]
["Finansiella skulder","Financial liabilities"]
["Finansiella skulder värderade till verkligt värde via resultatet","Financial liabilities reported at fair value via income statement"]
["Finansiella skulder värderade till upplupet anskaffningsvärde","Financial liabilities reported at net historical acqusition cost"]
["Finansieringsverksamheten","Financing activities"]
["Anläggningstillgångar","Fixed assets"]
["Fast pris","Fixed Price"]
["Valutaterminer","Foreign exchange forwards"]
["Geografisk marknad","Geographic market"]
["Handelsvaror ","Goods for resale"]
["Goodwill","Goodwill"]
["Goodwill som uppstår vid förvärvet ","Goodwill som uppstår vid förvärvet "]
["Koncernen","Group"]
["Erhållna koncernbidrag","Group contribution received"]
["Summa koncernen","Group total"]
["Resultat efter finansiella poster","Income after financial items"]
["Skatt","Income tax"]
["Skatt ","Income tax"]
["Nedlagda utgifter på annans fastighet","Incurred expenses on other property"]
["Immateriella anläggningstillgångar","Intangible fixed assets"]
["Räntekostnader och liknande kostnader","Interest expenses and similar costs"]
["Räntekostnader och liknande resultatposter","Interest expenses and similar profit/loss items"]
["Ränteintäkter och liknande resultatposter","Interest income and similar profit/loss items"]
["Varulager","Inventories"]
["Investeringsverksamheten","Investing activities"]
["Investeringar","Investments"]
["Andelar i koncernföretag","Investments in group companies"]
["Jämförelsestörande poster","Items affecting comparability"]
["TSEK","KSEK"]
["Leasingskulder","Lease liabilities"]
["Skulder","Liabilities"]
["Skulder till kreditinstitut","Liabilities to credit institutions"]
["Skulder till kreditinstitut ","Liabilities to credit institutions"]
["Skulder till koncernföretag","Liabilities to Group companies"]
["LTM","LTM"]
["Maskiner och andra tekniska anläggningar","Machinery and other technical facilities"]
["MSEK","MSEK"]
["Redovisat värde","Net carrying amount"]
["Netto av kassaflöde från förvärvet","Net cash flow from the acquisition"]
["Periodens resultat","Net profit (-loss) for the period"]
["Årets resultat ","Net profit for the year"]
["Periodens resultat ","Net Profit/Loss for the period"]
["Nettoomsättning","Net sales"]
["Nettoomsättning","Net sales"]
["Nyemission","New issue"]
["Långfristiga skulder","Non-current liabilities"]
["Långfristiga skulder till kreditinstitut ","Non-current liabilities to credit institutions"]
["Fritt eget kapital","Non-restricted equity"]
["Norge","Norway"]
["Not","Note"]
["Ingående eget kapital ","Opening equity"]
["Den löpande verksamheten","Operating activities "]
["Rörelsens kostnader","Operating costs"]
["Rörelsens intäkter","Operating income"]
["Rörelseresultat","Operating income"]
["Rörelsemarginal","Operating margin"]
["Rörelseresultat (EBIT)","Operating profit (EBIT)"]
["Rörelseresultat","Operating profit (-loss)"]
["Rörelseresultat före av- och nedskrivningar (EBITDA)","Operating profit before depreciation and amortization (EBITDA)"]
["[Övrigt, specificera vad]","Other"]
["Övrigt","Other"]
["Periodens övrigt totalresultat","Other comprehensive income"]
["Övrigt totalresultat","Other comprehensive income"]
["Övrigt totalresultat för perioden, efter skatt","Other comprehensive income for the period, after tax"]
["Övrigt tillskjutet kapital","Other contributed capital "]
["Övriga kortfristiga skulder","Other current liabilities"]
["Övriga kortfristiga fordringar","Other current receivables"]
["Övriga externa kostnader","Other external expenses"]
["Övriga finansiella tillgångar","Other financial assets"]
["Övriga finansiella skulder","Other financial liabilities"]
["Övriga skulder","Other liabilities"]
["Övriga ej kassaflödespåverkande poster ","Other non-cash items"]
["Övriga rörelsekostnader","Other operating expenses"]
["Övriga rörelseintäkter","Other operating revenue"]
["Övriga intäkter","Other revenue"]
["Betald inkomstskatt","Paid tax"]
["Förutbetalda kostnader och upplupna intäkter","Prepaid expenses and accrued income"]
["Förutbetalda intäkter och upplupna kostnader","Prepaid income and accrued expenses"]
["Vara/tjänst A","Product/service A"]
["Vara/tjänst B","Product/service B"]
["Vara/tjänst C","Product/service C"]
["Resultat före skatt ","Profit (-loss) before tax"]
["Resultat per stamaktie (kr)","Profit per share (kr)"]
["Resultat före skatt","Profit/loss before tax"]
["Materiella anläggningstillgångar","Property plant and equipment"]
["Inköp av varor/ tjänster","Purchase of goods/services"]
["Förvärv av immateriella anläggningstillgångar","Purchase of intangible assets"]
["Köpeskilling (likvida medel) ","Purchase price (cash and cash equivalents)"]
["Fordringar hos koncernföretag","Receivables from Group companies"]
["Avstämning av tillgångar","Reconciliation of assets"]
["Avstämning av skulder","Reconciliation of liabilities"]
["Avstämning av resultat ","Reconciliation of results"]
["Återbetalningsskulder","Repayment liabilities"]
["Amortering av låneskulder","Repayment of debts"]
["Reserver","Reserves"]
["Reserver ","Reserves"]
["Bundet eget kapital","Restricted equtiy"]
["Balanserad vinst eller förlust ","Retained earnings"]
["Balanserade vinstmedel ","Retained earnings"]
["Balanserat resultat ","Retained earnings"]
["Returrättstillgångar","Return rights assets"]
["Intäkter/(Kostnader)","Revenue/(Costs)"]
["Nyttjanderättstillgångar","Right of use asset"]
["Försäljning av varor/ tjänster","Sale of goods/services"]
["Intäkter","Sales"]
["Försäljning mellan segmenten","Sales between segments"]
["Summa segment","Segment total"]
["Aktiekapital","Share capital "]
["Inbetalning aktiekapital","Share capital increases"]
["Överkursfond","Share premium reserve"]
["Erhållna aktieägartillskott","Shareholders’ contributions received"]
["Soliditet (%)","Solidity (%)"]
["Sverige","Sweden"]
["Sverige","Sweden"]
["Skatteskulder","Tax liabilities"]
["Skattefordringar","Tax receivables"]
["Summa ","Total"]
["Summa bokslutsdispositioner","Total appropriations"]
["SUMMA TILLGÅNGAR","Total assets"]
["Totala tillgångar","Total assets"]
["Summa kassa och bank ","Total cash and cash equivalents"]
["Summa omsättningstillgångar","Total current assets "]
["Summa kortfristiga skulder","Total current liabilities"]
["Summa kortfristiga fordringar","Total current receivables"]
["Summa eget kapital","Total equity"]
["Totalt eget kapital","Total equity"]
["Summa eget kapital och skulder","Total equity and liabilities"]
["Summa finansiella  anläggningstillgångar","Total financial assets"]
["Totala skulder","Total liabilities"]
["Summa anläggningstillgångar","Total non-current assets"]
["Summa långfristiga skulder","Total non-current liabilities"]
["Köpeskilling","Total purchase consideration"]
["Totala intäkter ","Total revenue"]
["Leverantörsskulder","Trade payables"]
["Transaktioner med koncernens ägare","Transactions with owners"]
["Typ av kund","Type of client"]
["Typ av avtal","Type of contract"]
["Typ av vara eller tjänst","Type of product or service"]
["Teckningsoptioner","Warrants"]
["[Typ av närstående 1]","[Type of related party 1]"]
["[Typ av närstående 2]","[Type of related party 2]"]
["Fordran på balansdagen","Receivable on the balance sheet date"]
["Förskott till leverantörer","Advances to suppliers"]
["Förvärvade likvida medel","Acquired cash and cash equivalents"]
["Kostnader för underhållsstopp","Costs for maintenance stoppages"]
["Löpande räkning","Current account"]
["Netto av totala identifierbara tillgångar värderade till verkligt värde","Net of total identifiable assets valued at fair value"]
["Nettovinst vid försäljning av verksamheter & materiella anläggningstillgångar","Net profit on sale of operations & tangible fixed assets"]
["Offentliga kunder","Public customers"]
["Poster som har omförts eller kan omföras till resultatet (efter skatt) ","Items that have been transferred or can be transferred to the result (after tax)"]
["Poster som inte kan omföras till resultatet (efter skatt) ","Items that cannot be transferred to profit or loss (after tax)"]
["Privata kunder","Private customers"]
["Segmentsresultat ","Segment result"]
["Totala intäkter från avtal med kunder","Total revenue from contracts with customers"]
["Valutakursdifferens vid omräkning av dotterföretag i utlandet","Exchange rate difference when translating subsidiaries abroad"]
["Valutasäkring m.m.","Currency hedging, etc."]
["Övriga upplysningar","Other information"]
["R12","LTM"]

{"sheet":"Income statement - 6Q","index":2,"n_rows":25,"n_cols":7,"rows_kept":25,"cut":false,"hidden":false,"merged":[]}
["Storskogen Group AB"]
[]
["Consolidated Income Statement, Group"]
[{"$f":"ActQ_Year","v":"Q1 2024"}]
[]
["SEK m",{"$f":"ActQ_Year","v":"Q1 2024"},{"$f":"m1Q_Q_Year","v":"Q4 2023"},{"$f":"m2Q_Q_Year","v":"Q3 2023"},{"$f":"m3Q_Q_Year","v":"Q2 2023"},{"$f":"m4Q_Q_Year","v":"Q1 2023"},{"$f":"m5Q_Q_Year","v":"Q4 2022"}]
["Net sales",8357.6325250177997,8997.0623476621004,8333.2957239999996,9461.8463216369,9213.4783212439015,9836.1388739990034]
["Cost of goods and services sold",-6703.4767580924108,-7145.4668892331492,-6725.9768110000005,-7496.9484727263398,-7321.4082020799133,-7901.3584021869619]
["Gross profit ",1654.15576692539,1851.5954584289532,1607.318912,1964.8978489105527,1892.0701191639889,1934.7804718120428]
["Selling expenses ",-801.95577147100096,-845.19388100367109,-750.7815157,-842.29031114596387,-808.34059428348996,-851.18372123275276]
["Administrative expenses  ",-519.86029564619002,-590.6828482682821,-462.26537830000001,-530.08118542859609,-510.07978393189802,-512.82981486008589]
["Other operating income",220.9200773684,259.01632439140002,281.26805330000002,202.11683256850003,343.36173922030002,497.31734377850006]
["Other operating expenses",-75.376595590600004,-154.61531647729998,-186.1636489,-189.70920295650001,-85.479121126299987,-276.22223913309995]
["Operating profit",477.88318158599941,520.11973707110087,489.3764228,604.93398194800204,831.53235904259998,791.86204036460344]
["Net financial items",-279.98601720060003,-276.8889503347001,-297.80490209999999,-356.94796262360018,-193.71149807759991,-238.5354786007]
["Profit before tax",197.89716438539955,243.23078673640009,191.57152070000001,247.98601932440116,637.82086096499984,553.32656176390242]
["Income tax ",-54.519362195299998,-99.811253899599919,-21.409255739999999,-132.71945319970004,-122.68861315629999,-136.7966448224]
["Profit for the period",143.37780219009954,143.41953283679933,170.1622649,115.266566124699,515.13224780870019,416.52991694150256]
[]
["Profit for the year attributable to:"]
["Owners of the parent company",115.60100353559984,103.99251432150032,142.73905389999999,71.611937505198696,459.86131829299967,367.38632715500177]
["Non-controlling interests",27.776804840899999,39.467055079899993,27.20901486,43.868826444100009,55.270929732699997,49.151214287199991]
[]
["Basic earnings per share, SEK",7.0000000000000007E-2,6.2418000000000001E-2,0.09,0.04,0.28000000000000003,0.22]
["Diluted earnings per share, SEK",7.0000000000000007E-2,6.1749999999999999E-2,0.08,0.04,0.28000000000000003,0.22]

{"sheet":"Balance sheet - 6Q","index":3,"n_rows":36,"n_cols":7,"rows_kept":36,"cut":false,"hidden":false,"merged":[]}
[{"$f":"+'Income statement - 6Q'!A1","v":"Storskogen Group AB"}]
[]
["Consolidated balance sheet, Group"]
[{"$f":"+'Income statement - 6Q'!A4","v":"Q1 2024"}]
[]
["SEK m",{"$f":"ActQ_Year","v":"Q1 2024"},{"$f":"m1Q_Q_Year","v":"Q4 2023"},{"$f":"m2Q_Q_Year","v":"Q3 2023"},{"$f":"m3Q_Q_Year","v":"Q2 2023"},{"$f":"m4Q_Q_Year","v":"Q1 2023"},{"$f":"m5Q_Q_Year","v":"Q4 2022"}]
["Assets"]
["Intangible assets",25018.487605142906,24981.529050840109,25236,25826.399758957003,25514.058639342002,25566.476022694209]
["Property, plant and equipment ",5627.3566857232991,5391.1229164315018,5399,5419.8147289886028,5261.742013781899,5304.5245283964941]
["Financial non-current assets ",77.370499289717159,62.886037049900096,107,104.5607478761053,74.603715392794371,79.698756875596317]
["Pension obligation assets",2.7984267614,4.0860971052000004,10,10.270623581400001,1.8848753528,9.3638290916999996]
["Deferred tax assets",154.29597274060001,157.44044604410001,126,131.54276754189999,126.99425060749999,133.31544289069998]
["Total non-current assets ",30880.309189657924,30597.064547470807,30878,31492.588626945013,30979.283494476993,31093.348579948703]
["Inventories",4701.4391295911,4522.1363416225004,5031,5176.3091355798006,5165.1468824698004,5202.7315219596994]
["Trade receivables",4780.8037660038999,4440.6351997794,5023,4811.5582377000992,4972.0594443604996,4939.9524582970998]
["Current receivables ",3302.8225395361978,3048.6187095533005,3541,3837.6979618701021,3473.2025885525973,3223.0649954949013]
["Current investments",0.10528975300000001,0.14600761269999998,1,0.90693255369998838,1.1107697231,0.97879811689999996]
["Cash and cash equivalents",1406.9204171152001,1560.0911532867003,1421,1990.1679570899005,2612.6906537071,3022.1587598029]
["Total current assets ",14192.091141999397,13571.627411854603,15017,15816.640224793602,16224.210338813096,16388.886533671499]
["Total assets ",45072.400331657322,44168.691959325413,45895,47309.228851738619,47203.493833290093,47482.235113620205]
[""]
["Equity and liabilities"]
["Total equity ",20738.861138266995,20436.629676622582,20652,20681.387420270206,20214.66515785579,19627.93857521411]
["Interest-bearing non-current liabilities",10277.871966676301,10080.411379969397,11338.7504930952,11854.639628909699,12791.812580473999,13224.1715382763]
["Non-current lease liabilities",1388.5537690144995,1221.5881518822002,1254.2495069048,1146.7151975800998,1163.7090159780998,1229.2874808661004]
["Provisions for pensions",257.77459151510004,251.11073200200002,185,201.56418751690001,203.06360508739999,205.1916252405]
["Non-interest-bearing non-current liabilities",1909.1846767857999,1813.6133621803997,1666,1944.8903415980003,2157.4462341859999,2343.0519257752999]
["Provisions ",89.459892158900288,91.562443162500188,100,99.355613258299968,100.46077447590005,86.66867786810019]
["Deferred tax liabilities",1766.63218319,1789.3978247729001,1831,1885.0491248183,1846.3574783132999,1865.1049311042]
["Total non-current liabilities",15689.477079340602,15247.683893969399,16376,17132.214093681298,18262.849688514707,18953.506179130502]
["Interest-bearing current liabilities",602.78092237250019,545.6363397202,147.2722170138,609.96970760869999,164.49190624780005,199.90912701179991]
["Current lease liabilities",471.40619818729999,430.30853012099999,422.7277829862,421.97261754100003,415.46142819929997,425.05004065390006]
["Trade payables",2553.4248215667999,2270.5931542454,2538,2547.0409026838001,2638.3299025725,2563.2346129140001]
["Non-interest-bearing current liabilities",5016.450001612202,5237.8401761504001,5759,5916.6444649029991,5507.6957641390009,5712.6266017524013]
["Total current liabilities  ",8644.0619437388013,8484.378200236999,8867,9495.6276927364997,8725.979001158601,8900.8203823321019]
["Total equity and liabilities ",45072.400161346399,44168.691770828984,45895,47309.229206688004,47203.493847529098,47482.235136676711]

{"sheet":"Cash flow statement - 6Q","index":4,"n_rows":24,"n_cols":7,"rows_kept":24,"cut":false,"hidden":false,"merged":[]}
[{"$f":"+'Income statement - 6Q'!A1","v":"Storskogen Group AB"}]
[]
["Consolidated cash flow statement, Group "]
[{"$f":"+'Income statement - 6Q'!A4","v":"Q1 2024"}]
[]
["SEK m",{"$f":"ActQ_Year","v":"Q1 2024"},{"$f":"m1Q_Q_Year","v":"Q4 2023"},{"$f":"m2Q_Q_Year","v":"Q3 2023"},{"$f":"m3Q_Q_Year","v":"Q2 2023"},{"$f":"m4Q_Q_Year","v":"Q1 2023"},{"$f":"m5Q_Q_Year","v":"Q4 2022"}]
["Profit before tax",197.89716538539955,243.23078530289965,192,248.20000000000005,637.79999999999995,553.32881872199573]
["Adjustment for non-cash items",461.10177214999999,504.06506556989871,552,630.68599999999992,369.9,418.60914188980109]
["Income tax paid ",-386.72719243260002,19.546335237800008,-153,-249.79999999999995,-431.1,-5.9657628199000783]
["Change in working capital ",-163.23390849729992,691.8240836455999,-6,222.5,-110,306.1671239522002]
["Cash flow from operating activities",109.03783660550296,1458.6662697562003,584,851.58600000000001,466.59999999999991,1272.1393217440968]
["Net investments in non-current assets",-104.88525270619999,-169.19781008070004,-131,-119.89999999999998,-153.5,-209.82955802619799]
["Business combinations and divestments",-175.75332084980005,-59.801087442099515,65,-313.10000000000002,-84,-370.948846523501]
["Cash flow from investing activities",-280.63857355600004,-228.99889752279955,-66,-433,-237.5,-580.77840454969896]
["Dividend to owners of the parent company",0,0,"-",-133.101,0,0]
["Dividends to minority owners",-12.567030794000001,-5.912637386799986,-5,-90.73899999999999,-5,-25.690460112899984]
["Contributed capital from issued share options",0,0,"-",4.2699999999999996,0,1E-4]
["Change in loans",158.10466946550005,-910.52918008280039,-950,-720.86,-509.1,-633.48474547339993]
["Repayment of lease liability and other financing activities",-149.91047383259982,-148.07093735199982,-136,-145.97000000000003,-123,-151.3286609586998]
["Cash flow from financing activities",-4.3728351610997818,-1064.5127555580002,-1091,-1086.4000000000001,-637.1,-810.50376654499973]
["Cash flow for the period",-176.20305181539641,165.15461667540157,-573,-667.81400000000008,-408.00000000000011,-119.14284935060186]
["Cash and cash equivalents at beginning of period",1560.0911532867003,1420.9909420096999,1990,2612.6999999999998,3022.3903159330989,3159.0698871053]
["Exchange rate differences in cash and cash equivalents",22.8028359401,-26.056827149499998,4,45.3,-1.49,-17.635721821600001]
["Cash and cash equivalents at end of period",1406.6909374114039,1560.0911532867003,1421,1990.1859999999997,2612.9003159330991,3022.2913159330983]

{"sheet":"Net sales by vertical - 6Q","index":5,"n_rows":28,"n_cols":7,"rows_kept":28,"cut":false,"hidden":false,"merged":[]}
[{"$f":"+'Income statement - 6Q'!A1","v":"Storskogen Group AB"}]
[]
["Net sales by vertical"]
[{"$f":"+'Income statement - 6Q'!A4","v":"Q1 2024"}]
[]
["SEK m",{"$f":"ActQ_Year","v":"Q1 2024"},{"$f":"m1Q_Q_Year","v":"Q4 2023"},{"$f":"m2Q_Q_Year","v":"Q3 2023"},{"$f":"m3Q_Q_Year","v":"Q2 2023"},{"$f":"m4Q_Q_Year","v":"Q1 2023"},{"$f":"m5Q_Q_Year","v":"Q4 2022"}]
["Contracting Services",226.79688726590001,269.34957013070004,245,252.67892100130001,201.35883292029999,268.51718675649994]
["Infrastructure",481.15914927189999,681.51056735179986,561,663.96517766689999,493.42340283910011,648.15348918530037]
["Installation",716.71208250990003,826.60517719450002,731,1027.1723987680996,943.72907615510042,1073.3684933611005]
["Logistics",292.18950856079999,297.44700355879985,286,288.68702293090001,311.09632377230002,323.42514549249989]
["Engineering Services",369.09438294969999,418.09366654209992,374,414.42959631410002,403.35720560440001,516.74565767230013]
["Digital Services ",195.56658966140003,187.61210342410001,157,173.97586977229997,196.31629786709999,188.99627749480004]
["HR and Competence",216.586243723,245.25532654509996,226,255.15285805850004,240.1605368466,246.95299853730009]
["Intragroup sales within the business area",-8.3904723400000005,-7.7589009199999985,-6,-8.7634767199999999,-5.0404851900000001,-8.5947733900000003]
["Total, Services segment",2489.7143716025998,2918.1145138270999,2576,3067.2983677920993,2784.4011908149005,3257.5644751098007]
["Home and Living",682.87775268019993,710.45629420889964,633,727.67662369979996,877.80707333229998,904.47927032960035]
["Niche Businesses",673.2990645046001,797.86698363610003,670,757.56651525979987,743.24907184020003,906.95413142489997]
["Health and Beauty",712.12503513050001,774.41419119429975,710,669.18894691610001,649.79260124289999,720.55678527370003]
["Sports, Clothing and Accessories",263.75350169680001,257.78462793539995,332,409.24297474660005,341.13745636070001,381.94668982260021]
["Intragroup sales within the business area",-2.3438119981000001,-2.5141118306999992,-4,-2.2478306953999998,-4.0767053939000002,-6.3733860391000006]
["Total, Trade segment",2329.7115420139999,2538.0079851439991,2341,2561.4272299269001,2607.9094973822002,2907.5634908116999]
["Automation",1144.1195610481002,1157.6476475177999,1052,1224.5626805111001,1279.7079613467999,1249.1708758693003]
["Industrial Technology",1256.1119313139,1269.7006084845998,1278,1411.0305256071997,1389.5992881187001,1388.7793255826996]
["Products",1158.1345729998002,1135.6677251372023,1105,1215.7643012138001,1175.1412021466999,1065.4256852665003]
["Intragroup sales within the business area",-7.1376400000000002,-7.7460948326000008,-5,-6.7311048578999984,-11.5352254,-23.375272059999997]
["Total, Industry segment",3551.2284253618004,3555.2698863070013,3429,3844.6264024741999,3832.9132262121998,3680.0006146585001]
["Intragroup sales eliminations",-13.021813960599999,-14.330037616000002,-12,-11.505678556299999,-11.745593165399999,-8.9897065810000001]
["Total",8357.6325250177997,8997.0623476621004,8333,9461.8463216369,9213.4783212438997,9836.1388739989998]

{"sheet":"Quarterly data - 6Q","index":6,"n_rows":39,"n_cols":7,"rows_kept":39,"cut":false,"hidden":false,"merged":[]}
[{"$f":"+'Income statement - 6Q'!A1","v":"Storskogen Group AB"}]
[]
["Quarterly data, Group"]
[{"$f":"+'Income statement - 6Q'!A4","v":"Q1 2024"}]
[]
["SEK m",{"$f":"ActQ_Year","v":"Q1 2024"},{"$f":"m1Q_Q_Year","v":"Q4 2023"},{"$f":"m2Q_Q_Year","v":"Q3 2023"},{"$f":"m3Q_Q_Year","v":"Q2 2023"},{"$f":"m4Q_Q_Year","v":"Q1 2023"},{"$f":"m5Q_Q_Year","v":"Q4 2022"}]
["Net Sales"]
["Services",2489.7143716025998,2918.1145138270999,2576,3067.2983677920997,2784.4011908149,3257.5644751097998]
["Trade",2329.7115420139999,2538.0079851440005,2341,2561.4272299269001,2607.9094973822007,2907.5634908117004]
["Industry",3551.2284253618,3555.2698863070009,3429,3844.6264024741999,3832.9132262121998,3680.0006146584983]
["Group operations",-13.021813960599999,-14.330037616000002,-12,-11.505678556299999,-11.745593165399999,-8.9897065810000001]
["Group total",8357.6325250177997,8997.0623476621004,8333,9461.8463216369,9213.4783212439015,9836.1388739990034]
["","",""," ","","",""]
["Adjusted EBITA","",""," ","","",""]
["Services",204.12950887910003,257.27737155999904,242,307.14391448639947,250.30422754380049,366.86083289239838]
["Trade",169.04894461659998,151.37592066930043,188,246.10162804330059,219.24810374909961,227.72972347700079]
["Industry",386.77473801309912,373.60560502050151,353,436.82746846350051,483.19272317439936,405.8417416247006]
["Group operations",-56.601991971700009,-76.539235409499994,-57,-68.039329788800032,-67.554197827099983,-73.531811103399974]
["Group total",703.35119953709886,705.71966184030293,725,922.03368120439961,885.19085664020042,926.90048689070341]
["","",""," ","","",""]
["Adjusted EBITA-margin, %","",""," ","","",""]
["Services",8.1989127430591271,8.8165618703763755,9.4,10.013499753122732,8.9895173285192023,11.261813409849177]
["Trade",7.256217843624527,5.9643595116865535,8,9.6079882796562615,8.407044184975712,7.832321605242945]
["Industry",10.891294270198754,10.508501941285262,10.3,11.362026442475171,12.606409137310552,11.028306354301042]
["Group operations",0,0,"-",0,0,0]
["Group total",8.4156751021498266,7.8438898672707893,8.6999999999999993,9.7447543519697302,9.6075643288721793,9.4234180582879521]
[""]
["Number of employees, end of period"]
["Services",4159,4352,4328,4559,5152,5140]
["Trade",2422,2477,2464,2557,2372,2417]
["Industry",5221,5147,5240,5286,5310,5276]
["Group operations",91,101,102,103,106,112]
["Group total",11893,12077,12134,12505,12940,12945]
[""]
["Number of business units, end of period"]
["Services",57,58,57,61,62,62]
["Trade",29,32,32,32,33,35]
["Industry",39,39,39,39,39,39]
["Group total",125,129,128,132,134,136]

{"sheet":"APM - 6Q","index":7,"n_rows":36,"n_cols":7,"rows_kept":36,"cut":false,"hidden":false,"merged":[]}
[{"$f":"+'Income statement - 6Q'!A1","v":"Storskogen Group AB"}]
[]
["Performance measures"]
[{"$f":"+'Income statement - 6Q'!A4","v":"Q1 2024"}]
[]
["SEK m 1)",{"$f":"ActQ_Year","v":"Q1 2024"},{"$f":"m1Q_Q_Year","v":"Q4 2023"},{"$f":"m2Q_Q_Year","v":"Q3 2023"},{"$f":"m3Q_Q_Year","v":"Q2 2023"},{"$f":"m4Q_Q_Year","v":"Q1 2023"},{"$f":"m5Q_Q_Year","v":"Q4 2022"}]
["Net sales",8357.6325250177997,8997.0623476621004,8333,9461.8463216369,9213.4783212439015,9836.1388739990034]
["Adjusted EBITDA",987.08817855649943,978.09441335100087,999,1183.2388321384019,1132.881418085,1190.7798853237036]
["Adjusted EBITA",703.35119953709955,705.71966184030089,725,922.033681204402,885.19085664019997,926.92117266650359]
["Adjusted EBITA margin, %",8.4156751021498355,7.8438898672707671,8.6999999999999993,9.744754351969755,9.6075643288721739,9.4236283621080297]
["Operating profit",477.88318158599941,520.11973707110087,489,604.93398194800204,831.53235904259998,791.86204036460344]
["Operating margin, % ",5.7179252635899021,5.7809951401109805,5.9,6.3934031623898591,9.0251730133808543,8.0505374162398553]
["Profit before tax",197.89716438539955,243.23078673640009,192,247.98601932440116,637.82086096499984,553.32656176390242]
["Profit for the period",143.37780219009954,143.41953283679933,170,115.266566124699,515.13224780870019,416.52991694150256]
["Working capital",5724.2784828494805,5852.9131642043185,6077,6078.5925060191821,5761.5811216211987,5102.1055949941792]
["Return on working capital, % (12 months)",53.389777574842675,55.323024526194139,56.9,57.66754088104755,60.064253687653434,61.608979236171415]
["Return on equity, % (12 months)",2.7854303647255567,4.6451182161822144,6.1,7.7449821537525771,9.979084446745242,8.8468452343450128]
["Return on capital employed, % (12 months)",6.7511490797391271,7.7442623562019506,8.6,10.176399635751183,10.692727904413408,10.052410335801751]
["Equity/assets ratio, % ",46.01232902100562,46.26949264298478,45,43.715334031512462,42.824510468479914,41.337465916454754]
["Interest-bearing net debt",11509.693868787899,10902.252644009997,11706,11896.391429701198,12124.737113186406,12260.466173380204]
["Net debt",13730.311635497897,13159.367570417297,14055,14618.532500531201,14908.533370609608,15248.536480858205]
["Debt/equity ratio, x",0.66205716620393196,0.64391084922726782,0.7,0.70684486506951216,0.73751077518174368,0.77687837521944247]
["Interest-bearing net debt/adjusted RTM EBITDA (12 months), x",2.7866483957068247,2.5324628673658531,2.6,2.5863553438137568,2.6070986251178394,2.6319049831230048]
["Interest coverage ratio, x",2.1121153073083923,2.1941066111696017,1.8575723582919701,2.1917213227846952,4.2208208966712899,4.0718768246514481]
["Average number of employees",11130,11654,11834,12305,12216,11263]
["Number of employees at end of period",11893,12077,12134,12505,12940,12945]
["Cash flow from operating activities",109.03783660550296,1458.6662697562954,584,851.58600000000001,466.59999999999991,1272.1393217440968]
["Adjusted cash conversion, last 12 months, %",103.74652812788948,104.37561204022991,95,86.9,71.400000000000006,58.8]
["Adjusted cash conversion, Quarterly data, %",72.08733014190085,153.65682097670506,85,104.74290668598812,78.543647274556832,109.40739242276064]
["Basic earnings per share, SEK",7.0000000000000007E-2,0.06,0.09,0.04,0.28000000000000003,0.22]
["Diluted earnings per share, SEK",7.0000000000000007E-2,0.06,0.08,0.04,0.28000000000000003,0.22]
["Adjusted diluted earnings per share, SEK",9.3938239017036712E-2,0.04,0.1,0.13,0.18370884235804152,0.17]
[]
["1)  Unless otherwise stated"]
[]
["= Figures are based on the last 12 months, not on quarterly data"]

{"sheet":"APM - calculations - 6Q","index":8,"n_rows":207,"n_cols":7,"rows_kept":207,"cut":false,"hidden":false,"merged":[[200,1,200,6],[158,1,158,6],[169,1,169,6],[179,1,179,6],[187,1,187,6],[148,1,148,6],[102,1,102,6],[111,1,111,6],[120,1,120,6],[130,1,130,6],[140,1,140,6]]}
[{"$f":"+'Income statement - 6Q'!A1","v":"Storskogen Group AB"}]
[]
["Performance measures including calculations"]
[{"$f":"+'Income statement - 6Q'!A4","v":"Q1 2024"}]
[]
["Return on equity"]
[null,"12 months until","12 months until","12 months until","12 months until","12 months until","12 months until"]
["SEK m",{"$f":"ActQ_Year","v":"Q1 2024"},{"$f":"m1Q_Q_Year","v":"Q4 2023"},{"$f":"m2Q_Q_Year","v":"Q3 2023"},{"$f":"m3Q_Q_Year","v":"Q2 2023"},{"$f":"m4Q_Q_Year","v":"Q1 2023"},{"$f":"m5Q_Q_Year","v":"Q4 2022"}]
["Profit for the period",572.25749640263734,944.00350852520023,1217,1509.9454568250114,1868.4618822020157,1592.282074124794]
["Equity",20544.67071407189,20322.486201461394,20030,19495.79000764278,18723.780645141382,17998.524552215917]
["Return on equity, %",2.7854303647255567,4.6451182161822144,6.1,7.7449821537525771,9.9790844467453272,8.846736683917559]
[]
[]
["Return on working capital"]
[null,"12 months until","12 months until","12 months until","12 months until","12 months until","12 months until"]
["SEK m",{"$f":"ActQ_Year","v":"Q1 2024"},{"$f":"m1Q_Q_Year","v":"Q4 2023"},{"$f":"m2Q_Q_Year","v":"Q3 2023"},{"$f":"m3Q_Q_Year","v":"Q2 2023"},{"$f":"m4Q_Q_Year","v":"Q1 2023"},{"$f":"m5Q_Q_Year","v":"Q4 2022"}]
["Adjusted EBITA",3056.1795497579169,3238.0085853296009,3459,3505.374818400905,3460.6507013105092,3143.3312047640015]
["Working capital",5724.2784828494805,5852.9131642043185,6077,6078.5925060191821,5761.5811216211987,5102.1095973942602]
["Return on working capital, %",53.389777574842675,55.323024526194139,56.9,57.66754088104755,60.064253687653512,61.608461064210729]
[]
[]
["Return on capital employed"]
[null,"12 months until","12 months until","12 months until","12 months until","12 months until","12 months until"]
["SEK m",{"$f":"ActQ_Year","v":"Q1 2024"},{"$f":"m1Q_Q_Year","v":"Q4 2023"},{"$f":"m2Q_Q_Year","v":"Q3 2023"},{"$f":"m3Q_Q_Year","v":"Q2 2023"},{"$f":"m4Q_Q_Year","v":"Q1 2023"},{"$f":"m5Q_Q_Year","v":"Q4 2022"}]
["Operating profit",2092.354380291923,2445.9929362171024,2718,2898.5539755326063,2974.3862176613161,2612.8587248879971]
["Financial income",196.63618182969995,198.0162571795,263,605.33164456890006,540.7684565707001,478.50458072039999]
["Operating profit including financial income",2288.990562121623,2644.0091933966023,2980,3503.8856201015064,3515.1546742320161,3091.3633056083972]
["Capital employed",33905.199471762702,34141.524031390312,34499,34431.486041407443,32874.255341156975,30752.685155422452]
["Return on capital employed, %",6.7511490797391271,7.7442623562019506,8.6,10.176399635751183,10.692727904413434,10.052336210593676]
[]
[]
["Interest-bearing net debt"]
[]
["SEK m",{"$f":"ActQ_Year","v":"Q1 2024"},{"$f":"m1Q_Q_Year","v":"Q4 2023"},{"$f":"m2Q_Q_Year","v":"Q3 2023"},{"$f":"m3Q_Q_Year","v":"Q2 2023"},{"$f":"m4Q_Q_Year","v":"Q1 2023"},{"$f":"m5Q_Q_Year","v":"Q4 2022"}]
["Interest-bearing liabilities",10880.652889048801,10626.047719689599,11487.022710109,12464.609336518399,12956.3044867218,13424.080665288104]
["Lease liabilities",1859.9599672017994,1651.8966820025998,1676.9772898910001,1568.6878151210999,1579.1704441773998,1654.3375215199999]
["Provisions for pensions",254.97616475370003,247.02463489680002,175,201.56418751690001,203.06360508739999,205.1916252405]
["Financial assets",-78.869445348200003,-62.625249292299998,-210,-347.39501981160004,0,0]
["Current investments",1.0000000000000286E-4,1.0000000000010001E-5,-1,-0.90693255369998838,-1.1107697231,-0.97879811689999996]
["Cash and cash equivalents",-1406.9204171152001,-1560.0911532867003,-1421,-1990.1679570899005,-2612.6906537071,-3022.1587598029]
["Interest-bearing net debt",11509.799258540899,10902.252644009997,11706,11896.391429701198,12124.737112556406,12260.472254128805]
[]
[]
["Interest-bearing net debt/RTM adjusted EBITDA"]
[]
["SEK m",{"$f":"ActQ_Year","v":"Q1 2024"},{"$f":"m1Q_Q_Year","v":"Q4 2023"},{"$f":"m2Q_Q_Year","v":"Q3 2023"},{"$f":"m3Q_Q_Year","v":"Q2 2023"},{"$f":"m4Q_Q_Year","v":"Q1 2023"},{"$f":"m5Q_Q_Year","v":"Q4 2022"}]
["Interest-bearing net debt",11509.799258540899,10902.252644009997,11706,11896.391429701198,12124.737112556406,12260.472254128805]
["RTM adjusted EBITDA",4130.3,4305,4502,4599.674,4650.6629999999996,4658.3999999999996]
["Interest-bearing net debt/RTM adjusted EBITDA",2.7866739119533444,2.5324628673658531,2.6,2.5863553438137568,2.6070986249823749,2.6319062884528606]
[]
[]
["Net debt"]
[]
["SEK m",{"$f":"ActQ_Year","v":"Q1 2024"},{"$f":"m1Q_Q_Year","v":"Q4 2023"},{"$f":"m2Q_Q_Year","v":"Q3 2023"},{"$f":"m3Q_Q_Year","v":"Q2 2023"},{"$f":"m4Q_Q_Year","v":"Q1 2023"},{"$f":"m5Q_Q_Year","v":"Q4 2022"}]
["Interest-bearing liabilities",10880.652889048801,10626.047719689599,11487.022710109,12464.609336518399,12956.3044867218,13424.080665288104]
["Lease liabilities",1859.9599672017994,1651.8966820025998,1676.9772898910001,1568.6878151210999,1579.1704441773998,1654.3375215199999]
["Provisions for pensions",254.97616475370003,247.02463489680002,175,201.56418751690001,203.06360508739999,205.1916252405]
["Contingent consideration liabilities",171.32176709000001,320.17894439999998,326,669.51707045000001,836.79625782319999,997.09530747800011]
["Minority options",2049.2959996199997,1937.0819996199998,2023,2052.6240003800003,1946.9999995999999,1990.9749999999999]
["Financial assets",-78.869445348200003,-62.625249292299998,-210,-347.39501981160004,0,0]
["Current investments",1.0000000000000286E-4,1.0000000000010001E-5,-1,-0.90693255369998838,-1.1107697231,-0.97879811689999996]
["Cash and cash equivalents",-1406.9204171152001,-1560.0911532867003,-1421,-1990.1679570899005,-2612.6906537071,-3022.1587598029]
["Net debt",13730.311635497897,13159.367570417297,14055,14618.532500531201,14908.533369979607,15248.542561606804]
[]
[]
["Working Capital"]
[null,"12 months until","12 months until","12 months until","12 months until","12 months until","12 months until"]
["SEK m",{"$f":"ActQ_Year","v":"Q1 2024"},{"$f":"m1Q_Q_Year","v":"Q4 2023"},{"$f":"m2Q_Q_Year","v":"Q3 2023"},{"$f":"m3Q_Q_Year","v":"Q2 2023"},{"$f":"m4Q_Q_Year","v":"Q1 2023"},{"$f":"m5Q_Q_Year","v":"Q4 2022"}]
["Inventories",4919.1845808898006,5019.4430593635207,5166,5156.2813921327206,4924.0075227364596,4475.84124010502]
["Trade receivables",4805.5451559488993,4837.3748944075396,4969,4990.9320355548598,4870.6804769222999,4461.3222885451396]
["Other current receivables",2812.6995112510995,2798.2356811545401,2860,2879.6187662201005,2664.196273607,2298.6162496278002]
["Trade payables",-2674.5322635699604,-2675.3222044942804,-2768,-2823.3548027942802,-2762.5325600210394,-2570.6520606035601]
["Other current liabilities",-4138.6185016703603,-4126.8182662270001,-4148,-4124.8848850942195,-3934.7705916235209,-3563.0181202801405]
["Working capital",5724.2784828494805,5852.9131642043185,6077,6078.5925060191821,5761.5811216211987,5102.1095973942602]
[]
[]
["Debt/equity ratio"]
[]
["SEK m",{"$f":"ActQ_Year","v":"Q1 2024"},{"$f":"m1Q_Q_Year","v":"Q4 2023"},{"$f":"m2Q_Q_Year","v":"Q3 2023"},{"$f":"m3Q_Q_Year","v":"Q2 2023"},{"$f":"m4Q_Q_Year","v":"Q1 2023"},{"$f":"m5Q_Q_Year","v":"Q4 2022"}]
["Net debt",13730.311635497897,13159.367570417297,14055,14618.532500531201,14908.533369979607,15248.542561606806]
["Equity",20738.861138266995,20436.629676622684,20652,20681.387420270206,20214.66515785579,19627.93857521411]
["Debt/equity ratio, x",0.66205716620393196,0.64391084922726782,0.7,0.70684486506951216,0.73751077515057806,0.7768794722468948]
[]
[]
["Equity/assets ratio"]
[]
["SEK m",{"$f":"ActQ_Year","v":"Q1 2024"},{"$f":"m1Q_Q_Year","v":"Q4 2023"},{"$f":"m2Q_Q_Year","v":"Q3 2023"},{"$f":"m3Q_Q_Year","v":"Q2 2023"},{"$f":"m4Q_Q_Year","v":"Q1 2023"},{"$f":"m5Q_Q_Year","v":"Q4 2022"}]
["Equity",20738.861138266995,20436.629676622684,20652,20681.387420270206,20214.66515785579,19627.93857521411]
["Total assets",45072.400331657322,44168.691959325413,45895,47309.228851738619,47203.493833290093,47482.235113620205]
["Equity/assets ratio, %",46.01232902100562,46.26949264298478,45,43.715334031512462,42.824510467908354,41.337436050022561]
[]
[]
["Capital employed"]
[null,"12 months until","12 months until","12 months until","12 months until","12 months until","12 months until"]
["SEK m",{"$f":"ActQ_Year","v":"Q1 2024"},{"$f":"m1Q_Q_Year","v":"Q4 2023"},{"$f":"m2Q_Q_Year","v":"Q3 2023"},{"$f":"m3Q_Q_Year","v":"Q2 2023"},{"$f":"m4Q_Q_Year","v":"Q1 2023"},{"$f":"m5Q_Q_Year","v":"Q4 2022"}]
["Total assets",45929.662237061108,46411.629193453853,47017,47245.426470757484,45396.291415214284,42400.069794958792]
["Non-interest-bearing liabilities",-9884.9110165524799,-10121.933699847859,-10384,-10682.8512239749,-10472.813090700922,-9771.5079584743817]
["Provisions",-2139.5517487459197,-2148.1714622156805,-2134,-2131.08920537514,-2049.2229833563802,-1875.87668106196]
["Capital employed  ",33905.199471762702,34141.524031390312,34499,34431.486041407443,32874.255341156975,30752.685155422452]
[]
[]
["EBITA"]
[null,"Data by quarter"]
["SEK m",{"$f":"ActQ_Year","v":"Q1 2024"},{"$f":"m1Q_Q_Year","v":"Q4 2023"},{"$f":"m2Q_Q_Year","v":"Q3 2023"},{"$f":"m3Q_Q_Year","v":"Q2 2023"},{"$f":"m4Q_Q_Year","v":"Q1 2023"},{"$f":"m5Q_Q_Year","v":"Q4 2022"}]
["Operating profit",477.88318158599941,520.11973707110087,489,604.93398194800204,831.53235904259998,791.86204036460344]
["Amortisation of intangible assets",206.06053515330001,214.36597106399998,224,215.89916645270009,206.51067866060001,221.69829442050008]
["Impairment of intangible assets",1.5439949999999998E-4,0.22758106180000001,0.01,0.01,1.7276E-6,0.27904014800000004]
["EBITA",683.94387113879941,734.71328919690086,714,820.82920083900217,1038.0430394308,1013.8393749331036]
[]
[]
["EBITDA"]
[null,"Data by quarter"]
["SEK m",{"$f":"ActQ_Year","v":"Q1 2024"},{"$f":"m1Q_Q_Year","v":"Q4 2023"},{"$f":"m2Q_Q_Year","v":"Q3 2023"},{"$f":"m3Q_Q_Year","v":"Q2 2023"},{"$f":"m4Q_Q_Year","v":"Q1 2023"},{"$f":"m5Q_Q_Year","v":"Q4 2022"}]
["Operating profit",477.88318158599941,520.11973707110087,489,604.93398194800204,831.53235904259998,791.86204036460344]
["Amortisations and depreciations",489.79751417270001,487.1958905747,498,477.10431738669996,454.20124183299998,486.41322250290017]
["Impairment",1.5439949999999998E-4,-0.22758693820000001,1E-3,1E-3,1.7276E-6,-0.57717527720000006]
["EBITDA",967.68085015819941,1007.0880407076008,988,1082.0343517730021,1285.7336026031999,1277.6980875903037]
[]
[]
["Net financial items"]
[null,"Data by quarter"]
["SEK m",{"$f":"ActQ_Year","v":"Q1 2024"},{"$f":"m1Q_Q_Year","v":"Q4 2023"},{"$f":"m2Q_Q_Year","v":"Q3 2023"},{"$f":"m3Q_Q_Year","v":"Q2 2023"},{"$f":"m4Q_Q_Year","v":"Q1 2023"},{"$f":"m5Q_Q_Year","v":"Q4 2022"}]
["Interest income",16.928863881200002,22.982425114499996,13.975845625199998,13.044457076700001,26.385579244500001,11.734835154100001]
["Interest expenses  ",-234.27321593430003,-247.52769962080009,-270.77052658539998,-281.99043858889991,-203.43399146399997,-197.34705597929999]
["Financial expenses",-55.428463435299996,-34.827691210600008,-31.302873891499999,-35.992172316800001,-24.8262577679,-50.1]
["Exchange rate changes and other",-7.2132017122000036,-17.515984617800015,-9.7073472423000098,-52.009808794599977,7.8903088898000036,-2.8479331018000025]
["Net financial items",-279.98601720060003,-276.88895033470016,-298,-356.94796262360018,-193.71149807759991,-238.56015392699999]
[]
[]
["Adjusted EBITA"]
[null,"Data by quarter"]
["SEK m",{"$f":"ActQ_Year","v":"Q1 2024"},{"$f":"m1Q_Q_Year","v":"Q4 2023"},{"$f":"m2Q_Q_Year","v":"Q3 2023"},{"$f":"m3Q_Q_Year","v":"Q2 2023"},{"$f":"m4Q_Q_Year","v":"Q1 2023"},{"$f":"m5Q_Q_Year","v":"Q4 2022"}]
["Operating profit",477.88318158599941,520.11973707110087,489,604.93398194800204,831.53235904259998,791.86204036460344]
["Reversal of items affecting comparability",19.407328398299999,-28.993627356599983,11,101.2044803654,-152.85218279059998,-86.918202266599906]
["Amortisations of intangible assets",206.06053515330001,214.36597106399998,224,215.89916645270006,206.51067866060001,221.69829442050008]
["Impairment of intangible assets",1.5439949999999998E-4,0.22758106180000001,1E-3,1E-3,1.7276E-6,0.27904014800000004]
["Adjusted EBITA",703.35119953709943,705.71966184030089,725,922.033681204402,885.19085664019997,926.92117266650359]
[]
[]
["Adjusted EBITA-margin"]
[null,"Data by quarter"]
["SEK m",{"$f":"ActQ_Year","v":"Q1 2024"},{"$f":"m1Q_Q_Year","v":"Q4 2023"},{"$f":"m2Q_Q_Year","v":"Q3 2023"},{"$f":"m3Q_Q_Year","v":"Q2 2023"},{"$f":"m4Q_Q_Year","v":"Q1 2023"},{"$f":"m5Q_Q_Year","v":"Q4 2022"}]
["Adjusted EBITA",703.35119953709943,705.71966184030089,725,922.033681204402,885.19085664019997,926.92117266650359]
["Net sales",8357.6325250177997,8997.0623476621004,8333,9461.8463216369,9213.4783212439015,9836.1388739990034]
["Adjusted EBITA-margin, %",8.4156751021498337,7.8438898672707671,8.6999999999999993,9.744754351969755,9.6075643288721739,9.4236283621080297]
[]
[]
["Adjusted EBITDA"]
[null,"Data by quarter"]
["SEK m",{"$f":"ActQ_Year","v":"Q1 2024"},{"$f":"m1Q_Q_Year","v":"Q4 2023"},{"$f":"m2Q_Q_Year","v":"Q3 2023"},{"$f":"m3Q_Q_Year","v":"Q2 2023"},{"$f":"m4Q_Q_Year","v":"Q1 2023"},{"$f":"m5Q_Q_Year","v":"Q4 2022"}]
["Operating profit",477.88318158599941,520.11973707110087,489,604.93398194800204,831.53235904259998,791.86204036460344]
["Reversal of items affecting comparability",19.407328398299999,-28.993627356599983,11,101.2044803654,-152.85218279059998,-86.918202266599906]
["Amortisations and depreciations",489.79751417270001,487.1958905747,498,477.10431738669996,454.20124183299998,486.41322250290017]
["Impairment",1.5439949999999998E-4,-0.22758693820000001,1E-3,1E-3,1.7276E-6,-0.57717527720000006]
["Adjusted EBITDA",987.08817855649943,978.09441335100087,999,1183.2388321384019,1132.8814198125999,1190.7798853237036]
[]
[]
["Adjusted cash conversion"]
[null,"Data by quarter"]
["SEK m",{"$f":"ActQ_Year","v":"Q1 2024"},{"$f":"m1Q_Q_Year","v":"Q4 2023"},{"$f":"m2Q_Q_Year","v":"Q3 2023"},{"$f":"m3Q_Q_Year","v":"Q2 2023"},{"$f":"m4Q_Q_Year","v":"Q1 2023"},{"$f":"m5Q_Q_Year","v":"Q4 2022"}]
["Adjusted EBITDA",987.08817855649943,978.09441335100087,999,1183.2388321384019,1132.8814198125999,1190.7798853237036]
["Change in working capital",-163.23390849729992,691.82408364569994,-6,222.47716974879987,-109.96140551660002,306.13857385340009]
["Cash flow from net investments in tangible assets defined as CapEx",-112.28875599149998,-167.00971529080002,-144,-166.35725606809999,-133.11362787940001,-194.1172371497]
["Operating Cash Flow",711.5655140676995,1502.908781705901,849,1239.3587458191018,889.80638641659982,1302.8012220274036]
["Adjusted EBITDA",987.08817855649943,978.09441335100087,999,1183.2388321384019,1132.8814198125999,1190.7798853237036]
["Adjusted cash conversion, %",72.08733014190085,153.65682097670506,85,104.74290668598812,78.543647274556832,109.40739242276064]
[]
[]
["Interest coverage ratio"]
[null,"Data by quarter"]
["SEK m",{"$f":"ActQ_Year","v":"Q1 2024"},{"$f":"m1Q_Q_Year","v":"Q4 2023"},{"$f":"m2Q_Q_Year","v":"Q3 2023"},{"$f":"m3Q_Q_Year","v":"Q2 2023"},{"$f":"m4Q_Q_Year","v":"Q1 2023"},{"$f":"m5Q_Q_Year","v":"Q4 2022"}]
["Operating profit",477.88318158599941,520.11973707110087,489,604.93398194800204,831.53235904259998,791.83806850120357]
["Interest income",16.928863881200002,22.982425114499996,14,12.833570996699995,26.385579244500001,11.734835154100001]
["Operating profit including interest income",494.81204546719943,543.10216218560083,503,617.76755294470206,857.91793828710001,803.57290365530355]
["Interest expenses  ",-234.27321593430003,-247.52769962080009,-270.77052658539998,-281.99043858889991,-203.43399146399997,-197.34705597929999]
["Interest coverage ratio",2.1121153073083923,2.1941066111696017,1.8575723582919701,2.1917213227846952,4.2208208966712899,4.0718768246514481]
[]
[]
["Operating margin"]
[null,"Data by quarter"]
["SEK m",{"$f":"ActQ_Year","v":"Q1 2024"},{"$f":"m1Q_Q_Year","v":"Q4 2023"},{"$f":"m2Q_Q_Year","v":"Q3 2023"},{"$f":"m3Q_Q_Year","v":"Q2 2023"},{"$f":"m4Q_Q_Year","v":"Q1 2023"},{"$f":"m5Q_Q_Year","v":"Q4 2022"}]
["Operating profit",477.88318158599941,520.11973707110087,489,604.93398194800204,831.53235904259998,791.86204036460344]
["Net sales",8357.6325250177997,8997.0623476621004,8333,9461.8463216369,9213.4783212439015,9836.1388739990034]
["Operating margin, %",5.7179252635899021,5.7809951401109805,5.9,6.3934031623898591,9.0251730133808543,8.0505374162398553]
[]
[]
["Items affecting comparability"]
[null,"Data by quarter"]
["SEK m",{"$f":"ActQ_Year","v":"Q1 2024"},{"$f":"m1Q_Q_Year","v":"Q4 2023"},{"$f":"m2Q_Q_Year","v":"Q3 2023"},{"$f":"m3Q_Q_Year","v":"Q2 2023"},{"$f":"m4Q_Q_Year","v":"Q1 2023"},{"$f":"m5Q_Q_Year","v":"Q4 2022"}]
["Remeasurement of contingent considerations",3.4934024000001784E-3,32.150088338699973,-14,-53.072386551000001,157.06162415079999,93.469687135999905]
["Fair value adjustments of acquired assets",0,0,"-",0,0,-1.3480446022999999]
["Stamp tax on foreign business combinations",0,9.9999999999988987E-5,1E-3,-2.2325439999999999,0,0.01]
["Central restructuring costs",-19.135117999999999,-9.6837787039999998,"-",0,0,0]
["Capital gain/loss from divestment of business",1.0000000000010001E-5,6.6850405888000068,2,-45.899549814399997,-4.2094413601999996,-4.9984741586999997]
["Items affecting comparability, EBITA",-19.407328398299999,28.99362735659998,-11,-101.2044803654,152.85218279059998,87.133168374999912]
["One-off items related to refinancing of interest-bearing liabilities, before tax",-23.504663999999998,0,-7.7,-50.7,0,0]
["Items affecting comparability, earnings per share",-42.911992398300001,28.99362735659998,-19.112676882100001,-151.90448036539999,152.85218279059998,87.133168374999912]
[]
[]
["Adjusted diluted earnings per share"]
[null,"Data by quarter"]
[null,{"$f":"ActQ_Year","v":"Q1 2024"},{"$f":"m1Q_Q_Year","v":"Q4 2023"},{"$f":"m2Q_Q_Year","v":"Q3 2023"},{"$f":"m3Q_Q_Year","v":"Q2 2023"},{"$f":"m4Q_Q_Year","v":"Q1 2023"},{"$f":"m5Q_Q_Year","v":"Q4 2022"}]
["Net profit for the period attributable to owners of the parent company, SEK m",115.60100353559984,103.99251432149956,142.77557716850063,71.724791178599204,459.86069800060108,367.3674819560008]
["Reversal of items affecting comparability, SEK m",42.911992398300001,-28.993627356599983,19.112676882099969,151.90448036539999,-152.85218279059998,-86.918202266599906]
["Total",158.51299593389984,74.998886964899569,161.88825405060061,223.62927154399921,307.00851521000106,280.4492796894009]
["Total weighted average number of shares, millions",1687.417154,1687.5455079999999,1687.7172029999999,1671.2031850000001,1671.1689610000001,1670.8602719999999]
["Adjusted diluted earnings per share, SEK",9.3938239017036712E-2,4.4442586353588026E-2,9.5921433853276075E-2,0.13381333493808487,0.18370884235804152,0.16784723677325]

{"sheet":"SysAdmin","index":9,"n_rows":17,"n_cols":3,"rows_kept":17,"cut":false,"hidden":true,"merged":[]}
[]
[null,"Selinmatning",true]
[null,"SelDia",true]
[null,"SelPubl",true]
[null,"SelAdmOrg",true]
[null,"SelTxtdata",true]
[null,"SelLngNo",{"$f":"IF(Sel_Lang=\"ENG\",2,1)","v":2}]
[null,"SelMal",false]
[null,"TblTyp","OVR"]
[null,"Adm_ActiveSheet:","Nyckeltal_(P)"]
[null,"SelLangText","ENG"]
[null,"SelQuarter","Q1"]
[null,"HistoryStart",2021]
[null,"SelYear",2024]
[null,"Large Icons",false]
[null,"Versionsnr för verktyget","0.7"]
[null,"EnableRetrieve",true]